program: Gaussian 09
title: 000211016
version: EM64L-G09RevD.01
frameworkgroup: C1[X(C15H20N2O)]
method: RPBEPBE
basis: SDD
operation: Freq
keyword: #p
keyword: freq=noraman
keyword: PBEPBE/SDD
title: #p freq=noraman PBEPBE/SDD
converged: YES YES NO NO
title: Mulliken charges:
elementType: O N N C C C C C C C C C C C C C C C H H H H H H H H H H H H H H H H H H H H
charge: -0.306326 -0.294346 -0.009156 0.230767 0.167952 0.211708 0.255151 -0.445602 -0.713552 -0.689678 -0.395650 -0.389054 -0.415380 -0.226510 -0.368843 -0.234443 -0.230125 -0.625985 0.201981 0.225500 0.201215 0.239134 0.234320 0.236500 0.205883 0.246832 0.256304 0.204393 0.247618 0.245141 0.173424 0.208984 0.231781 0.230714 0.254552 0.224498 0.188035 0.222262
chargesum: 0.00000
title: Mulliken charges with hydrogens summed into heavy atoms:
elementType: O N N C C C C C C C C C C C C C C C
charge: -0.306326 -0.039794 -0.009156 0.230767 0.167952 0.211708 0.255151 -0.018120 -0.038883 -0.000462 0.065048 -0.141436 -0.170239 -0.226510 0.013564 -0.002662 0.000589 0.008809
polarizability: 2.01264445e+02 2.91966721e+00 1.70616627e+02 1.73372788e+01 -1.95577762e+00 1.42415528e+02
1716.lowfreq: -9.7878 -2.3372 -0.0007 0.0003 0.0005 6.0087 30.6522 46.5092 47.7576
frequency: 30.6379 46.4881 47.7543 58.2116 85.3358 99.9658 106.9372 138.4547 148.7243 152.7740 189.1465 195.0020 208.4223 229.3865 232.0722 271.6042 300.9468 302.3672 335.4180 357.8007 390.8808 428.7555 440.0844 467.6170 514.6960 519.1476 544.2142 559.8777 611.3982 632.3583 660.3927 699.0439 726.6828 751.5782 762.2444 766.3020 805.0049 853.0665 875.1696 907.4618 924.4042 936.0596 946.0479 949.8949 959.4283 990.3028 994.8571 1022.2442 1042.5167 1052.3573 1077.0222 1081.5191 1103.4418 1121.7967 1126.1282 1150.0377 1158.1162 1171.8186 1174.2394 1196.7178 1207.0837 1212.9051 1266.8429 1271.2873 1281.1978 1293.2167 1299.4073 1340.7181 1375.7455 1377.4480 1390.9707 1392.9109 1435.7009 1443.3368 1445.8992 1450.4875 1450.5667 1460.9863 1462.9828 1465.9227 1474.3393 1475.7310 1482.1133 1489.1268 1498.5433 1600.1561 1615.9353 2173.5295 2819.7044 2864.7959 2971.3144 2979.2469 2985.9379 2988.6597 2991.7900 3009.3192 3043.2851 3073.4303 3074.0050 3083.3864 3090.7369 3098.0805 3104.2001 3127.1929 3134.6705 3147.3976 3166.1391 3450.2389
redmass: 3.8903 4.4695 1.7074 4.1452 4.9460 3.2610 4.0131 2.2729 3.5368 3.5417 2.2049 1.2585 2.6817 1.3576 1.1993 2.0649 3.1799 3.1774 2.9345 3.6383 3.7517 4.2271 4.5194 5.5456 4.0204 4.3439 4.1300 3.5299 5.7871 2.1727 1.9819 6.2914 3.4824 1.4678 3.2160 1.3230 2.1700 2.1755 1.3763 3.0735 1.6606 2.2286 1.7506 2.3818 2.0137 1.3290 1.3119 2.3123 3.0539 3.2963 2.2378 1.6502 2.2129 1.9067 1.7955 1.8502 2.4662 2.3102 1.1546 3.7997 1.7727 2.2015 1.4193 1.3107 1.4526 1.1038 2.7223 1.4109 1.2194 1.4957 4.2512 1.3872 1.1508 1.8228 1.2238 1.1678 1.0728 1.1034 1.5518 1.0815 1.0774 1.3820 1.1062 1.0657 1.0703 7.4006 7.0223 12.6821 1.0716 1.0570 1.0705 1.0620 1.0353 1.0795 1.0355 1.0745 1.0970 1.0990 1.0990 1.0992 1.0988 1.1013 1.1009 1.0863 1.0894 1.0946 1.1003 1.0745
irintensity: 1.1149 0.5249 2.9155 1.6075 1.8605 0.5398 1.4383 3.5083 0.8934 1.1166 0.4013 0.1198 1.4914 0.6295 1.6196 0.0287 1.3666 1.0585 3.0840 6.1708 0.4850 4.9030 2.5516 1.4911 19.1318 1.4417 1.5662 3.2044 1.6289 56.0242 62.0053 5.9806 11.9235 2.3812 5.2563 68.7683 8.5684 30.2018 0.1868 36.4905 12.0410 20.8314 12.7233 9.9689 8.9594 0.0132 0.2588 7.7392 3.8336 9.2328 8.5107 12.3430 16.3754 4.6418 12.1849 33.3874 12.8021 23.6240 2.7550 12.3558 9.2013 4.9111 15.0647 8.5233 2.9365 1.0451 34.6844 5.5146 26.0441 12.7497 4.1958 13.7983 2.0829 11.6459 3.7884 17.1433 11.0550 3.2110 1.1291 7.9698 8.4052 8.0558 16.2202 15.8627 6.8485 0.0151 1.2038 1.6814 102.9541 175.6939 1.5481 18.4570 14.1978 54.4741 20.9566 51.7331 8.3060 42.3064 28.5908 5.8014 35.4945 16.0018 30.8295 3.1873 3.3769 22.6248 24.5818 0.7768
temp: 298.150 k
press: 1.00000 atm
elementType: 8 7 7 6 6 6 6 6 6 6 6 6 6 6 6 6 6 6 1 1 1 1 1 1 1 1 1 1 1 1 1 1 1 1 1 1 1 1
symmnumber: 1
zpe: 831231.2 jmol-1
zpe.correction: 0.316599 hartree
zpe.thermalcorrener: 0.335644 hartree
zpe.thermalcorrenthalpy: 0.336588 hartree
zpe.thermalcorrgfe: 0.268706 hartree
zpe.sumelectzpe: -766.938933 hartree
zpe.sumelectthermal: -766.919889 hartree
zpe.sumelectthermalent: -766.918944 hartree
zpe.sumelectthermalfe: -766.986827 hartree
dipole: -1.8883 -1.5516 -3.4517
dipole: 4.2293
quadrupole: -92.5372 -101.9746 -122.2295
quadrupole: -6.2348 4.8067 0.6003
quadrupole: 13.0432 3.6058 -16.6490 -6.2348 4.8067 0.6003
hfenergy: -767.2555327 hartree
pointgroup: C01 [X(C15H20N2O1)]
dipole: 0.7868468 -0.4137566 1.4065476 debye
polarizability: 201.8265305|0.5910433|170.6762641|16.6515641|-0.4402876|141.7938055 unknown
InChI: InChI=1S/C15H20N2O/c1-14(2)12-7-4-5-8-13(12)15(11-16,18-14)9-6-10-17-3/h4-5,7-8,17H,6,9-10H2,1-3H3
charge 0 multiplicity 1
38 atoms
O  0.004007 1.367207 -0.156522
N  -5.114449 0.101855 0.313175
N  -0.363397 -0.509977 -3.054672
C  -0.099411 -0.097567 -0.411316
C  1.449535 1.754627 0.092664
C  1.240776 -0.653057 0.07988
C  2.114421 0.413241 0.380965
C  -1.332825 -0.640466 0.35315
C  1.428852 2.715377 1.292378
C  2.010279 2.422038 -1.182619
C  -2.660884 0.023856 -0.062264
C  1.639051 -1.993281 0.235474
C  3.413943 0.153564 0.857198
C  -0.247561 -0.327391 -1.880946
C  -3.852205 -0.526987 0.744824
C  2.9428 -2.257321 0.719466
C  3.822789 -1.191249 1.028779
C  -6.312156 -0.351261 1.04121
H  -1.387466 -1.736646 0.194581
H  -1.138214 -0.469479 1.428965
H  2.449095 3.074458 1.520368
H  0.79658 3.590098 1.061695
H  1.020932 2.213329 2.185556
H  1.425835 3.327635 -1.420269
H  3.067307 2.712247 -1.036905
H  1.953219 1.733892 -2.043442
H  -2.594665 1.116157 0.083287
H  -2.839414 -0.149438 -1.144071
H  0.962229 -2.817827 -0.014431
H  4.100292 0.974334 1.0942
H  -3.872687 -1.646803 0.658669
H  -3.707604 -0.298995 1.820854
H  3.274967 -3.292453 0.853143
H  4.829272 -1.41072 1.401733
H  -5.233115 0.046764 -0.707092
H  -6.229011 -0.062663 2.106024
H  -6.484177 -1.456388 1.007914
H  -7.208434 0.14779 0.631899
