program: Gaussian 09
title: 000216400
version: EM64L-G09RevD.01
frameworkgroup: C1[X(C19H31NO4)]
method: RPBEPBE
basis: SDD
operation: Freq
keyword: #p
keyword: freq=noraman
keyword: PBEPBE/SDD
title: #p freq=noraman PBEPBE/SDD
converged: YES YES NO NO
title: Mulliken charges:
elementType: O O O O N C C C C C C C C C C C C C C C C C C C H H H H H H H H H H H H H H H H H H H H H H H H H H H H H H H
charge: -0.317451 -0.290162 -0.293899 -0.283981 -0.447679 -0.169211 -0.432678 0.122151 0.132106 -0.345357 0.213192 0.211561 -0.348322 0.100540 0.343368 0.080948 -0.764677 -0.763048 -0.701681 -0.713578 -0.705241 -0.714806 -0.254475 -0.669486 0.266839 0.213661 0.216536 0.192147 0.192859 0.286492 0.193363 0.192888 0.267360 0.270703 0.185415 0.270649 0.267740 0.186793 0.208589 0.208421 0.214268 0.268309 0.208098 0.216758 0.226452 0.227751 0.201278 0.219597 0.207960 0.267988 0.230423 0.217080 0.212736 0.250342 0.222372
chargesum: 0.00000
title: Mulliken charges with hydrogens summed into heavy atoms:
elementType: O O O O N C C C C C C C C C C C C C C C C C C C
charge: -0.317451 -0.290162 -0.293899 -0.283981 -0.161187 0.097628 -0.002482 0.122151 0.132106 0.039649 0.213192 0.211561 0.037930 0.100540 0.343368 0.080948 -0.041199 -0.037866 -0.070403 -0.020413 -0.049760 -0.019261 0.193029 0.015964
polarizability: 2.76656810e+02 -3.24515940e+00 2.51497153e+02 1.01216426e+01 2.39717063e+01 1.91462666e+02
1716.lowfreq: -12.0076 -4.8783 -1.7223 0.0003 0.0007 0.0008 18.7140 20.2483 29.3873
frequency: 18.2190 19.3817 29.1985 36.7276 44.6772 57.2851 61.3650 63.3115 83.1158 88.1637 98.4439 100.3313 112.0949 121.0706 126.3973 138.6055 155.9025 172.2019 193.6281 208.4924 215.8822 217.8408 230.1311 233.1779 241.8732 257.9988 279.7168 315.0293 317.4291 327.3657 335.2218 341.4388 352.7615 372.3689 382.6990 384.8867 421.0172 427.9350 440.1250 455.3943 542.2613 552.0854 567.5654 573.2820 596.8406 631.5913 646.7594 694.2481 722.2749 728.5206 730.6309 737.7795 771.2939 774.3908 800.6920 814.5195 826.7131 838.4594 896.3481 913.8318 914.6710 919.8213 926.3718 951.5608 975.2605 978.1010 1008.3757 1019.1872 1027.2196 1031.4606 1032.5559 1036.6918 1037.2297 1048.3289 1074.9737 1077.9871 1094.4184 1102.9505 1131.7594 1150.5633 1156.6471 1172.3475 1204.5929 1217.4494 1226.6963 1253.7187 1258.1578 1270.2712 1273.0255 1280.6287 1287.2729 1293.7811 1300.9111 1310.7893 1338.9332 1341.4795 1356.0758 1359.5127 1369.3587 1375.1959 1383.5301 1387.9838 1397.0410 1406.4755 1411.3408 1437.5135 1440.8724 1443.3346 1452.7052 1460.0862 1461.1556 1461.6934 1465.0754 1465.3993 1467.0040 1467.2177 1468.0212 1475.1086 1476.2387 1477.8565 1479.3283 1484.3523 1487.5828 1501.4923 1562.7521 1580.3488 1630.5707 1646.6410 2955.7681 2964.7721 2969.0866 2977.8060 2985.7850 2986.7356 2987.7279 2987.9815 2990.1470 2993.0405 2996.0862 3019.2175 3025.0520 3042.5751 3054.6882 3065.9062 3067.6785 3077.7184 3080.1582 3080.9201 3081.1182 3083.7438 3089.2120 3093.3358 3095.8300 3100.9229 3101.1982 3114.5954 3114.7556 3118.3142 3549.0648
redmass: 3.0996 3.2270 3.7376 3.1841 2.5461 2.1341 3.2607 3.3062 2.2920 1.8552 2.4165 3.5898 2.5358 1.2246 2.6455 2.6224 3.3353 1.1302 2.3176 1.6133 3.3409 1.8488 1.2041 1.1715 1.0922 2.7157 3.2853 3.7186 4.2298 3.4492 2.9330 3.1483 5.3871 4.3241 3.9313 3.1883 3.1571 2.9582 3.0194 3.1035 4.0641 3.5321 3.6256 2.4617 1.9172 3.5889 3.8430 6.4023 1.8033 5.7281 4.9990 1.5520 5.0865 2.6822 1.5875 1.5201 3.1936 3.2341 1.8623 3.0516 1.6456 1.6321 1.3173 1.2026 2.9975 1.9605 2.3348 2.2648 1.4200 1.4810 1.5454 3.1096 1.6760 3.5001 1.8986 2.4585 2.1217 2.3178 2.4960 1.8962 3.7680 2.0142 1.9145 1.4900 1.4009 3.0045 3.6365 2.6551 1.3530 1.1168 1.1023 1.4129 3.7607 2.1310 1.4681 2.0493 1.4999 1.4322 1.2312 1.2342 1.2179 1.2358 1.2241 1.2135 1.1714 1.0508 1.0509 1.0477 1.1228 1.0813 1.1341 1.0673 1.0933 1.0778 1.0717 1.0665 1.0808 1.0442 2.1133 1.0685 1.0542 1.0512 1.0864 1.0592 6.4641 8.0667 4.0495 9.1406 1.0578 1.0591 1.0363 1.0589 1.0402 1.0363 1.0356 1.0395 1.0361 1.0365 1.0982 1.1021 1.0588 1.1038 1.0839 1.1007 1.0992 1.0993 1.0973 1.0990 1.0977 1.0984 1.1028 1.0992 1.1003 1.0963 1.0964 1.1051 1.0999 1.0992 1.0772
irintensity: 0.0121 0.2224 0.1630 0.2192 0.1174 0.0211 5.3167 2.2301 0.4485 0.4324 1.4121 0.5122 0.0529 1.0288 0.4268 0.9501 1.5980 0.0843 4.2827 0.5163 1.1056 1.3583 0.0023 0.1082 0.0594 0.6621 0.8675 11.0390 3.7615 4.0540 1.8408 2.4478 5.2635 6.5757 2.8063 2.2149 2.5669 1.3077 2.7213 5.7108 1.3377 1.9344 5.4910 16.5491 38.7391 9.3384 2.3491 21.9688 3.2196 3.3226 4.8695 8.0556 4.7431 2.8574 0.7477 0.3371 8.3548 1.5744 9.0199 0.6615 0.6715 1.7103 0.4476 0.2953 65.9873 69.5009 151.3031 82.3974 0.2402 12.1403 23.1100 208.5968 35.5640 215.9644 98.2073 41.9994 21.5028 24.8514 137.4612 43.6126 14.3954 224.0022 42.7727 81.6003 16.5573 24.4158 204.1819 11.1635 16.1240 3.3833 0.5648 0.0908 60.8903 12.8097 2.6961 13.8655 1.7419 2.3021 45.4055 56.9892 12.0402 29.4827 47.6843 116.9213 9.6288 18.7861 24.7117 0.6558 58.7160 13.9150 67.0006 18.1408 14.2010 11.4907 24.9168 6.0600 35.4150 17.1440 286.4033 0.3165 4.8025 17.7269 12.0109 35.1262 428.5077 83.1055 0.3669 224.8281 0.3397 35.0551 37.2714 48.7104 27.4914 27.2797 10.1487 46.4895 23.6704 37.0168 0.2166 5.2955 41.8828 40.3346 3.5992 84.7924 54.5761 9.8040 19.0308 18.3105 22.0379 38.2890 8.3675 75.2961 30.8250 3.5624 9.9093 30.5140 2.7316 16.2328 39.6474
temp: 298.150 k
press: 1.00000 atm
elementType: 8 8 8 8 7 6 6 6 6 6 6 6 6 6 6 6 6 6 6 6 6 6 6 6 1 1 1 1 1 1 1 1 1 1 1 1 1 1 1 1 1 1 1 1 1 1 1 1 1 1 1 1 1 1 1
symmnumber: 1
zpe: 1227099.3 jmol-1
zpe.correction: 0.467377 hartree
zpe.thermalcorrener: 0.496411 hartree
zpe.thermalcorrenthalpy: 0.497355 hartree
zpe.thermalcorrgfe: 0.405475 hartree
zpe.sumelectzpe: -1096.408218 hartree
zpe.sumelectthermal: -1096.379184 hartree
zpe.sumelectthermalent: -1096.378240 hartree
zpe.sumelectthermalfe: -1096.470120 hartree
dipole: -0.0992 -0.8447 -0.1109
dipole: 0.8578
quadrupole: -152.0291 -126.9905 -144.8029
quadrupole: 8.6958 1.0389 8.7838
quadrupole: -10.7549 14.2837 -3.5288 8.6958 1.0389 8.7838
hfenergy: -1096.8755953 hartree
pointgroup: C01 [X(C19H31N1O4)]
dipole: 0.0286589 0.2782181 -0.1888287 debye
polarizability: 276.8335046|-6.4072632|219.7369864|-7.2703865|-38.4997957|223.0461383 unknown
InChI: InChI=1S/C19H31NO4/c1-8-10-11-14-15(17(21)23-9-2)12(3)20-13(4)16(14)18(22)24-19(5,6)7/h14,20H,8-11H2,1-7H3
charge 0 multiplicity 1
55 atoms
O  -2.424419 -0.915764 0.138947
O  2.10198 -2.09802 0.399759
O  -3.339275 0.563487 -1.441204
O  3.754463 -1.345345 -1.071529
N  0.747502 1.388921 -2.553905
C  0.194036 -0.253803 -0.299108
C  0.323903 0.51359 1.063097
C  -0.912753 0.34858 -1.175494
C  1.532781 -0.297423 -1.047704
C  0.7277 1.999873 0.95874
C  -0.602256 1.214325 -2.210115
C  1.793416 0.582726 -2.084949
C  0.830781 2.681865 2.342857
C  -2.326708 0.049055 -0.87712
C  -3.778227 -1.425657 0.611171
C  2.574603 -1.24258 -0.621262
C  -1.575433 1.9855 -3.075663
C  3.102204 0.748425 -2.826166
C  1.228185 4.171393 2.255067
C  -4.578307 -0.259844 1.228323
C  -3.373566 -2.457442 1.679358
C  -4.519924 -2.096837 -0.563256
C  3.072932 -3.104866 0.910894
C  3.937477 -2.511899 2.028595
H  -0.092817 -1.284943 -0.036521
H  -0.649368 0.430985 1.586532
H  1.066023 -0.028922 1.681777
H  1.703614 2.087589 0.438669
H  -0.013379 2.546852 0.340374
H  0.959463 2.04522 -3.306389
H  1.571279 2.136042 2.96304
H  -0.142072 2.587164 2.867717
H  -2.216791 1.299874 -3.655453
H  -2.266742 2.583656 -2.461231
H  -1.038872 2.652083 -3.777292
H  3.93582 0.921184 -2.127178
H  3.364421 -0.172888 -3.374214
H  3.047444 1.587866 -3.544775
H  0.486486 4.744954 1.667205
H  2.211154 4.290195 1.760823
H  1.295787 4.634344 3.257101
H  -4.839571 0.486086 0.461903
H  -5.508945 -0.650442 1.679923
H  -3.990117 0.231959 2.023795
H  -2.784758 -1.977213 2.480044
H  -2.760834 -3.25897 1.231649
H  -4.276085 -2.910887 2.127394
H  -3.884574 -2.874227 -1.023842
H  -5.439402 -2.581792 -0.18645
H  -4.794807 -1.356412 -1.329884
H  3.698165 -3.455327 0.070784
H  2.431962 -3.923608 1.277285
H  4.589763 -3.296612 2.455854
H  4.579103 -1.705559 1.63586
H  3.307756 -2.10671 2.839964
