program: Gaussian 09
title: 000211012
version: EM64L-G09RevD.01
frameworkgroup: C1[X(C16H24N2O2)]
method: RPBEPBE
basis: SDD
operation: Freq
keyword: #p
keyword: freq=noraman
keyword: PBEPBE/SDD
title: #p freq=noraman PBEPBE/SDD
converged: YES YES NO NO
title: Mulliken charges:
elementType: O O N N C C C C C C C C C C C C C C C C H H H H H H H H H H H H H H H H H H H H H H H H
charge: -0.329688 -0.244597 -0.093053 -0.615551 0.141665 0.178466 0.246262 0.262480 -0.469878 -0.433078 -0.715995 -0.710141 0.167247 -0.403166 -0.422992 -0.359670 -0.237299 -0.236385 -0.605484 -0.637348 0.165271 0.275230 0.257990 0.202830 0.200941 0.231245 0.229749 0.190645 0.289268 0.220467 0.232805 0.242778 0.191740 0.196196 0.225268 0.226056 0.330745 0.319408 0.220752 0.186556 0.221086 0.215852 0.187703 0.257623
chargesum: 0.00000
title: Mulliken charges with hydrogens summed into heavy atoms:
elementType: O O N N C C C C C C C C C C C C C C C C
charge: -0.329688 -0.244597 -0.093053 0.034602 0.141665 0.178466 0.246262 0.262480 -0.029377 0.027741 -0.054060 -0.009760 0.167247 -0.170361 -0.180213 0.028266 -0.012031 -0.010329 0.022910 0.023830
polarizability: 1.98573298e+02 1.87181647e+01 1.84818643e+02 -9.40782978e+00 1.34883151e+01 1.80570183e+02
1716.lowfreq: -6.1887 -0.0002 0.0003 0.0007 5.5555 9.4714 24.5389 32.9875 53.3593
frequency: 24.4067 32.9515 53.3527 59.6015 79.9061 83.9586 112.6224 114.9382 120.8894 170.9323 195.5635 204.9711 219.7096 231.9535 246.5290 254.3706 279.2283 287.0128 305.8792 311.8469 320.3017 349.9567 352.8573 373.5218 413.6291 420.4388 464.6771 478.8669 495.5688 515.6557 522.1899 545.3777 556.2285 585.5919 599.6108 638.2463 699.0468 710.5094 718.0906 736.2990 761.3750 765.0958 785.9420 833.3229 867.3666 881.2081 910.9214 924.3946 933.8983 941.5304 945.4676 977.9522 984.0681 996.7716 1023.1561 1036.8528 1045.2161 1060.7657 1074.0133 1075.0012 1085.2262 1098.2349 1106.2826 1129.8334 1138.8325 1152.3010 1162.4996 1172.2474 1193.2375 1203.6742 1223.7465 1249.3493 1264.9478 1274.4494 1290.2509 1293.8205 1299.2300 1317.6877 1359.6859 1366.7341 1372.9168 1389.1188 1390.3140 1418.8910 1441.5613 1441.8193 1447.4626 1459.6258 1461.1695 1462.3849 1465.7504 1471.8936 1474.5187 1477.3138 1478.1088 1487.5555 1488.5291 1496.2158 1583.0286 1597.7868 1614.8232 1639.4030 2826.6531 2844.6040 2861.5210 2952.6665 2980.7852 2985.4921 2991.6658 2993.8149 3014.6470 3027.3910 3048.5302 3066.2016 3074.1910 3076.4123 3084.1338 3084.7772 3095.0935 3110.2467 3121.7953 3127.9308 3142.1873 3161.8239 3516.6600 3672.8367
redmass: 3.6387 4.5950 5.6212 2.6117 3.8013 3.5917 3.5941 3.7633 4.4458 3.2155 1.0455 2.0881 1.4444 1.2382 1.3413 2.5658 2.0045 2.6306 2.3175 2.8310 3.1066 2.4763 2.1704 3.3738 2.7843 2.6376 3.0614 2.2548 1.5998 2.7386 4.2754 2.8411 3.4711 2.5511 2.2953 3.0134 5.3701 4.1382 3.0403 2.1542 1.4187 3.3914 2.4312 2.5735 1.4973 1.9697 3.0221 1.9374 2.2239 1.4355 2.7650 2.3030 1.3253 1.3044 2.2832 1.5344 2.1142 2.2449 2.8037 1.9675 1.8822 1.6314 2.2435 1.9954 1.5033 1.7749 1.8706 1.0868 3.9312 2.2589 1.8868 1.8672 1.9391 1.6486 1.4251 1.6003 2.7574 2.1473 1.5034 1.3565 1.2093 1.4970 3.4873 1.1423 1.8542 1.3149 1.0631 1.1028 1.4448 1.0708 1.0512 1.1423 1.4102 1.0620 1.0885 1.0580 1.0740 1.0668 1.5205 7.1622 6.4027 3.4571 1.0696 1.0575 1.0573 1.0685 1.0356 1.0352 1.0874 1.0646 1.0716 1.0727 1.0888 1.0989 1.1008 1.0990 1.1002 1.0993 1.1010 1.1006 1.0855 1.0894 1.0943 1.1003 1.0447 1.1037
irintensity: 0.0659 4.2970 6.4831 1.1047 2.8471 0.2578 3.8425 0.0565 1.4931 0.6283 0.1026 0.5435 0.0264 0.1032 1.0240 1.2715 2.3537 0.4855 2.1805 2.8087 7.8485 1.2809 2.9914 3.8687 0.7404 0.4051 10.0596 28.4996 89.4626 44.9537 1.0259 37.0726 8.3015 19.9072 35.6352 25.6345 0.3219 21.8026 5.3162 12.6498 64.5239 10.5571 16.7796 9.2974 2.8632 5.1194 14.3067 1.2941 10.6022 2.7215 29.1872 34.0334 0.0480 0.1712 9.7746 20.8204 16.1889 2.1060 3.6121 19.0187 15.5994 17.8269 16.3461 3.8051 3.9858 17.4961 10.4864 0.3570 12.1953 7.6515 46.4357 5.9184 31.1537 8.4327 9.6056 23.4642 34.7875 64.0455 1.7806 9.4675 26.9872 19.3137 9.2433 2.1942 7.7339 8.1026 6.9938 10.0223 2.4090 7.9132 3.0865 13.3150 8.2581 17.4925 17.3886 16.2870 17.0694 9.5844 78.0250 0.7048 0.4580 245.9516 71.2960 92.0831 263.6826 34.4854 21.0155 34.2017 32.8193 36.2108 43.1760 30.8270 5.6639 27.6837 41.1904 7.7502 46.0960 28.3987 28.6179 5.7885 4.4116 4.4836 28.1923 30.1937 21.5160 26.8828
temp: 298.150 k
press: 1.00000 atm
elementType: 8 8 7 7 6 6 6 6 6 6 6 6 6 6 6 6 6 6 6 6 1 1 1 1 1 1 1 1 1 1 1 1 1 1 1 1 1 1 1 1 1 1 1 1
symmnumber: 1
zpe: 978043.7 jmol-1
zpe.correction: 0.372517 hartree
zpe.thermalcorrener: 0.393738 hartree
zpe.thermalcorrenthalpy: 0.394682 hartree
zpe.thermalcorrgfe: 0.322577 hartree
zpe.sumelectzpe: -882.513771 hartree
zpe.sumelectthermal: -882.492551 hartree
zpe.sumelectthermalent: -882.491606 hartree
zpe.sumelectthermalfe: -882.563711 hartree
dipole: 1.9190 0.5977 3.2306
dipole: 3.8048
quadrupole: -114.7361 -105.9980 -125.6435
quadrupole: 8.7209 -6.0534 9.2818
quadrupole: 0.7231 9.4612 -10.1844 8.7209 -6.0534 9.2818
hfenergy: -882.8862886 hartree
pointgroup: C01 [X(C16H24N2O2)]
dipole: -0.7084463 -0.288906 1.2866507 debye
polarizability: 200.2601364|17.2537549|185.4717412|9.241688|-14.1489965|178.2302464 unknown
InChI: InChI=1S/C16H24N2O2/c1-15(2)12-8-5-6-9-13(12)16(20-15,14(17)19)10-7-11-18(3)4/h5-6,8-9H,7,10-11,17H2,1-4H3
charge 0 multiplicity 1
44 atoms
O  0.09515 0.423719 -1.264138
O  1.272366 -2.008166 -2.101829
N  -3.833732 0.71975 0.792475
N  0.049978 -3.194806 -0.540491
C  0.153881 -0.701489 -0.302484
C  1.306653 1.321291 -1.136358
C  1.321645 -0.34429 0.61729
C  1.978546 0.806714 0.130346
C  -1.213499 -0.745633 0.426328
C  -2.418684 -0.914839 -0.524649
C  0.771628 2.760233 -0.99853
C  2.184319 1.146529 -2.393443
C  0.527101 -2.011646 -1.083747
C  1.76937 -0.997275 1.781744
C  3.097872 1.328421 0.806982
C  -3.764573 -0.628174 0.176583
C  2.89109 -0.472555 2.467752
C  3.551625 0.682632 1.982574
C  -5.017062 0.863907 1.663648
C  -3.737274 1.817166 -0.192845
H  -1.214564 -1.531422 1.212596
H  -1.332254 0.211411 0.96531
H  -2.278869 -0.237524 -1.385751
H  -2.459896 -1.940795 -0.941745
H  1.607238 3.482075 -0.941308
H  0.156307 3.012126 -1.879998
H  0.150419 2.862996 -0.092221
H  3.123016 1.72421 -2.296802
H  2.416677 0.079171 -2.537282
H  1.638932 1.507472 -3.283369
H  1.267481 -1.897957 2.153435
H  3.613017 2.221105 0.433923
H  -4.593905 -0.782202 -0.5644
H  -3.919952 -1.367193 0.988733
H  3.253281 -0.964304 3.377432
H  4.420594 1.077145 2.521032
H  0.325408 -4.069457 -0.98766
H  -0.602635 -3.217984 0.239488
H  -5.004935 0.080287 2.442798
H  -5.989396 0.785835 1.11178
H  -4.991547 1.84719 2.166986
H  -3.794214 2.786473 0.334191
H  -4.554638 1.790275 -0.95868
H  -2.769363 1.776575 -0.720697
