program: Gaussian 09
title: 000210997
version: EM64L-G09RevD.01
frameworkgroup: C1[X(C7H15NO2)]
method: RPBEPBE
basis: SDD
operation: Freq
keyword: #p
keyword: freq=noraman
keyword: PBEPBE/SDD
title: #p freq=noraman PBEPBE/SDD
converged: YES YES NO NO
title: Mulliken charges:
elementType: O O N C C C C C C C H H H H H H H H H H H H H H H
charge: -0.268551 -0.241223 -0.079796 -0.330725 -0.390749 -0.491970 -0.614215 -0.626193 0.240451 -0.505206 0.167611 0.207642 0.225377 0.237155 0.233366 0.247328 0.224103 0.185400 0.222398 0.218924 0.183955 0.239471 0.240358 0.232968 0.242120
chargesum: 0.00000
title: Mulliken charges with hydrogens summed into heavy atoms:
elementType: O O N C C C C C C C
charge: -0.268551 -0.241223 -0.079796 0.044528 0.071784 -0.011276 0.017686 0.016157 0.240451 0.210240
polarizability: 1.18714708e+02 1.45917407e+00 8.47945282e+01 1.16465863e+00 -5.31374200e-01 6.90328135e+01
1716.lowfreq: -16.3855 -7.5979 -4.0673 -0.0008 -0.0007 -0.0005 16.9634 38.4967 66.6385
frequency: 16.2999 38.4150 66.6323 87.7140 91.9532 111.6619 173.6124 210.9349 224.1364 237.6627 249.5710 299.2276 332.9305 399.0248 432.8171 490.3630 575.1577 664.5610 754.1361 801.2539 841.2480 859.2315 953.3828 1023.0102 1033.6504 1058.2096 1069.0490 1083.5239 1093.2580 1112.4782 1118.8931 1138.7354 1147.2696 1169.7941 1212.9958 1258.4126 1272.7119 1279.7855 1296.2319 1348.3992 1378.1797 1418.6661 1421.4189 1441.4751 1444.5571 1451.9858 1459.8839 1462.2224 1464.2648 1474.1952 1478.5684 1481.5564 1488.5544 1646.5151 2803.1595 2839.8784 2856.1966 2973.1571 2999.1962 3003.8753 3009.8965 3017.3570 3031.6748 3052.4702 3076.1156 3080.3830 3090.3848 3105.2447 3148.1224
redmass: 3.9761 2.9314 2.6347 1.9127 1.2886 2.1516 3.2206 2.1711 1.5112 1.4898 1.8929 3.3905 2.2898 3.4244 2.2318 2.9749 3.2383 4.4518 1.1865 4.9317 3.6717 1.5833 6.1347 2.2816 1.5772 4.0869 1.7837 1.8608 1.4567 1.2772 1.7635 1.8343 1.4420 1.7728 1.8616 2.1411 1.2398 1.5767 1.2488 1.5738 1.4623 1.1446 1.1882 1.1489 1.0953 1.0503 1.0598 1.0628 1.0506 1.0683 1.0491 1.0738 1.0725 9.1292 1.0704 1.0576 1.0576 1.0659 1.0853 1.0296 1.0605 1.0715 1.0721 1.0942 1.1013 1.1019 1.1000 1.1045 1.1048
irintensity: 1.4189 0.6960 0.0478 0.7375 0.2183 0.3211 5.7375 6.8788 0.6898 3.3816 3.4010 17.3602 10.1594 3.6860 0.0484 6.4988 6.3195 5.7417 11.2886 18.3483 12.8847 4.7985 29.6195 27.6480 17.8250 5.3223 7.8064 36.7059 4.0436 2.5296 78.6021 101.5261 5.7099 94.6457 17.0517 1.4215 18.4087 45.0516 22.4019 30.9697 6.0166 2.6057 20.7218 7.6027 12.9354 14.1481 6.8723 20.1023 13.7239 4.7829 13.1839 11.4155 22.3753 161.8011 89.3329 73.5016 224.9959 11.9341 25.4419 33.8883 20.9534 46.3758 45.5939 0.8190 22.7149 55.2992 36.5233 28.7792 17.3724
temp: 298.150 k
press: 1.00000 atm
elementType: 8 8 7 6 6 6 6 6 6 6 1 1 1 1 1 1 1 1 1 1 1 1 1 1 1
symmnumber: 1
zpe: 563605.6 jmol-1
zpe.correction: 0.214666 hartree
zpe.thermalcorrener: 0.227658 hartree
zpe.thermalcorrenthalpy: 0.228602 hartree
zpe.thermalcorrgfe: 0.173252 hartree
zpe.sumelectzpe: -480.087586 hartree
zpe.sumelectthermal: -480.074594 hartree
zpe.sumelectthermalent: -480.073650 hartree
zpe.sumelectthermalfe: -480.129000 hartree
dipole: -0.1747 -1.5441 0.8583
dipole: 1.7752
quadrupole: -49.5254 -65.8731 -63.0334
quadrupole: 2.1913 2.7529 0.0373
quadrupole: 9.9519 -6.3958 -3.5561 2.1913 2.7529 0.0373
hfenergy: -480.3022522 hartree
pointgroup: C01 [X(C7H15N1O2)]
dipole: 0.0653461 0.6575356 0.2261653 debye
dipolederiv: -1.4286736 -0.2404661 0.1544179 -0.3563021 -0.5982292 0.0908299 0.2134398 0.0765569 -0.332389 -0.6901566 0.1250309 0.008213 -0.1816665 -0.9014782 0.1157749 0.0744404 0.0770276 -0.3308164 -0.7008179 0.0189037 0.0339091 -0.018772 -0.5039231 -0.0088658 -0.0315231 -0.0079783 -0.5793996 0.4947084 0.152385 0.0629203 0.1375775 0.191382 0.0764317 0.0644152 0.0759549 0.4507927 -0.0347864 0.0113951 0.006257 0.0914598 0.0350561 -0.0179368 -0.0217345 -0.0363134 0.1133483 -0.3200993 0.0975602 0.0321236 0.1939054 -0.0544097 -0.0290845 0.126741 -0.0411778 0.1458056 0.3558726 -0.1790604 -0.0517847 -0.2565085 0.2192096 0.0658717 -0.0418144 0.0701518 0.3441487 0.0621588 0.0527698 -0.0677939 0.0761291 0.3235881 -0.0822087 -0.1080104 -0.0829559 0.4248249 1.6154349 0.0890942 -0.1825212 0.4250584 1.2011889 -0.2049348 -0.3333792 -0.1518029 0.2522103 0.6135891 0.0126611 -0.0396769 -0.1017598 0.2199454 0.0182323 -0.010937 0.009321 0.2796474 -0.0797709 -0.0182316 0.0285751 -0.0303745 0.011682 -0.0487489 -0.1051739 -0.1397059 -0.2825409 0.0416009 -0.018286 -0.0057503 -0.031878 -0.1471649 0.0784589 -0.005333 0.1015633 0.0104686 0.0591055 -0.0073475 -0.00516 -0.0084436 0.0558744 -0.0588862 0.0165602 -0.0611221 -0.1208886 0.1079786 0.0000177 -0.0032002 -0.0159002 -0.0720841 0.0721901 0.0118971 0.084199 0.0247932 0.0776322 0.0287932 0.0209878 -0.0044891 0.0688392 -0.0504876 -0.0332429 -0.0730575 -0.0816573 0.0472698 -0.009336 0.0018939 -0.04942 -0.0318198 0.0809986 -0.0103668 0.1076776 0.0374412 0.0927561 -0.0512182 0.0518493 0.0299122 -0.1192109 0.1208956 0.0323171 0.1116637 0.0164046 -0.051625 0.0776816 0.0146439 0.1168496 -0.0034547 -0.0458035 0.1976896 -0.1546495 -0.2308638 -0.1398199 -0.0494407 -0.077054 -0.1300379 0.0358717 -0.0717567 -0.0732068 -0.0586373 0.0546301 -0.1212751 -0.1537006 -0.0622364 -0.0835666 0.0455702 -0.016532 -0.0855947 -0.0322173 0.0424369 0.0633832 -0.0267353 0.0340031 -0.0028725 -0.0187488 -0.0692533 0.0885808 0.1143484 -0.2999382 -0.018408 0.1731448 0.0268102 0.1402371 -0.0145037 -0.0013016 0.0418507 0.0093015 0.059098 -0.0046623 0.0080401 0.006597 0.096455 0.0667435 0.071044 -0.0667918 0.0678288 -0.0820723 -0.0405425 -0.076066 0.0304338 -0.1234747 -0.0175186 0.0369471 0.0387902 0.0317473 0.111169 -0.0008526 -0.0175889 -0.0184574 0.0878819 0.0075945 -0.1218741 0.0203862 -0.0977242 -0.0266532 unknown
polarizability: 118.664898|1.4929844|84.5210914|-1.8078639|-2.2280505|69.3560601 unknown
InChI: InChI=1S/C7H15NO2/c1-8(2)6-4-5-7(9)10-3/h4-6H2,1-3H3
charge 0 multiplicity 1
25 atoms
O  3.170071 0.760907 -0.118261
O  2.221949 -1.315233 0.343046
N  -2.966505 -0.078612 -0.247457
C  -1.747881 0.624916 0.21636
C  -0.44708 -0.140994 -0.097567
C  0.794977 0.711025 0.239469
C  -4.157974 0.792845 -0.1851
C  -3.19807 -1.365478 0.440516
C  2.088052 -0.083199 0.164052
C  4.499166 0.103469 -0.165965
H  -1.788259 0.83879 1.320479
H  -1.719835 1.606772 -0.296931
H  -0.44517 -0.412996 -1.169411
H  -0.390977 -1.083619 0.47513
H  0.711615 1.099873 1.276463
H  0.880541 1.594801 -0.417069
H  -3.982019 1.708287 -0.778093
H  -4.430596 1.10279 0.857006
H  -5.026521 0.266519 -0.620061
H  -4.111814 -1.836108 0.035999
H  -3.327289 -1.253365 1.548499
H  -2.358308 -2.057078 0.261249
H  4.72545 -0.375011 0.801894
H  5.206592 0.916083 -0.382527
H  4.517384 -0.662784 -0.959116
