program: Gaussian 09
title: 000216363
version: EM64L-G09RevD.01
frameworkgroup: C1[X(C24H27N3O)]
method: RPBEPBE
basis: SDD
operation: Freq
keyword: #p
keyword: freq=noraman
keyword: PBEPBE/SDD
title: #p freq=noraman PBEPBE/SDD
converged: YES YES NO NO
title: Mulliken charges:
elementType: O N N N C C C C C C C C C C C C C C C C C C C C C C C C H H H H H H H H H H H H H H H H H H H H H H H H H H H
charge: -0.458345 -0.043809 -0.160872 -0.110513 -0.049501 0.097361 -0.429631 -0.441973 -0.013965 0.179927 -0.413250 -0.418844 0.040152 0.240079 -0.073684 -0.374510 -0.415327 -0.619338 -0.353397 0.335663 -0.253718 -0.243542 -0.666428 -0.391745 -0.426905 -0.244396 -0.260242 -0.249394 0.231761 0.213606 0.219394 0.211080 0.232674 0.213973 0.178082 0.176511 0.212541 0.344377 0.265575 0.243116 0.185878 0.221700 0.221474 0.213875 0.249515 0.229965 0.228698 0.240281 0.221123 0.232344 0.263482 0.294571 0.223164 0.225937 0.225448
chargesum: 0.00000
title: Mulliken charges with hydrogens summed into heavy atoms:
elementType: O N N N C C C C C C C C C C C C C C C C C C C C C C C C
charge: -0.113968 -0.043809 -0.160872 -0.110513 0.182260 0.097361 0.003369 0.001781 -0.013965 0.179927 -0.021196 -0.029791 0.040152 0.240079 -0.073684 -0.108935 -0.172211 0.009714 0.109994 0.335663 -0.023753 -0.014844 0.027320 -0.128263 -0.132334 -0.021232 -0.034305 -0.023946
polarizability: 3.80987673e+02 1.99518840e+01 2.80192271e+02 1.32340801e+01 -4.35476443e+01 2.07614662e+02
1716.lowfreq: -6.2668 -3.3092 -0.0004 0.0003 0.0006 4.4080 26.2594 35.0090 43.0737
frequency: 26.2444 34.9503 43.0598 48.4129 55.2637 60.9844 81.4373 91.7596 116.1564 125.4968 159.7493 171.7385 187.3714 204.4948 217.5566 222.2888 227.4242 241.1056 256.7266 262.8308 286.4703 290.5300 323.8149 339.0651 347.8444 370.3845 373.8460 387.6172 409.1804 428.0125 447.0678 453.5557 476.1441 480.2387 492.0008 528.2242 536.6412 563.1349 589.1945 615.2131 645.0179 653.5572 660.6373 678.2367 705.5400 709.3850 733.4825 743.9408 758.7528 767.6992 777.2441 788.4632 794.0539 821.4039 842.3721 865.9371 875.0607 879.7533 922.0653 942.1259 946.7850 957.2772 962.5313 973.4784 982.0506 985.6969 986.9218 991.8997 993.9956 1004.3888 1018.2550 1023.0069 1026.0349 1044.4259 1058.4630 1067.1052 1077.1476 1084.9976 1089.2194 1090.6421 1109.3247 1116.5594 1134.0288 1139.7962 1153.3318 1163.0813 1171.3966 1177.3011 1190.2039 1195.2986 1196.2907 1209.2754 1252.6579 1259.0645 1274.0243 1276.9601 1284.3060 1287.2068 1302.8461 1307.2472 1312.2207 1318.8915 1338.2423 1340.8561 1348.5499 1351.2429 1360.7368 1374.5857 1377.4866 1384.5140 1391.8653 1429.7155 1430.4258 1436.9203 1443.6403 1452.4814 1461.4094 1462.5753 1464.3080 1464.9544 1465.6398 1469.6687 1478.3283 1482.1269 1485.4141 1497.6115 1527.9944 1534.2705 1585.2442 1594.1861 1618.1110 1623.0688 2811.9097 2821.4527 2853.4853 2969.0000 2990.1252 2990.3357 3001.4186 3011.8710 3013.3694 3017.1211 3022.6846 3055.7189 3071.8843 3075.7705 3079.4064 3093.4510 3106.6731 3116.7556 3125.0875 3127.4651 3137.2451 3139.2082 3152.5877 3155.5692 3164.4263 3169.2156 3552.6269
redmass: 4.6354 3.8964 2.6938 2.7581 4.0619 3.9221 4.5945 3.8683 4.3869 4.6382 2.2163 3.9829 3.8278 2.8226 2.0367 1.8229 2.6049 2.0098 2.5958 2.5306 4.4468 2.9954 2.9557 3.0615 2.1538 2.2923 1.5020 4.4488 2.8587 3.2123 3.5382 3.5045 4.7366 3.1841 3.5148 3.6967 4.5603 3.7020 4.6096 6.3212 3.9966 6.7015 6.0825 5.6664 4.9017 1.8332 3.1062 3.2192 3.1123 1.7028 3.0906 2.5505 1.2899 1.4954 4.4860 1.2606 2.8860 1.3822 2.1307 1.4475 1.4624 2.8245 2.8704 2.3633 1.6397 1.5850 3.3756 1.4525 3.6705 1.3322 3.0627 2.3879 2.5153 2.7053 2.3290 1.8459 2.1281 1.7988 1.8608 1.7651 1.8795 2.3492 1.9413 2.2056 1.3345 1.9490 1.0575 1.2541 1.6262 1.7977 1.4346 3.3925 2.0264 1.8515 1.7379 1.6620 1.7220 1.5477 1.6056 1.3195 2.0090 1.2967 1.4531 1.5894 1.4720 1.3752 1.4787 1.3941 6.3253 5.1789 1.2481 2.1121 1.2511 2.6348 2.4710 1.1006 1.0589 2.7721 1.0809 1.0935 1.1155 1.0415 1.1041 1.0576 1.0616 5.6599 5.7119 7.1986 6.0943 6.5904 6.0392 7.4604 1.0716 1.0690 1.0576 1.0811 1.0537 1.0421 1.0644 1.0648 1.0723 1.0839 1.0849 1.1029 1.1009 1.1023 1.0995 1.0982 1.1021 1.0875 1.0879 1.0856 1.0929 1.0905 1.0958 1.0949 1.1000 1.0985 1.0659
irintensity: 0.0936 0.1313 0.2868 0.2724 0.6827 0.4914 0.5795 1.1322 0.4665 0.2558 0.9419 0.0513 0.3174 0.9104 2.0574 0.5731 2.4293 0.3511 1.9993 1.2101 1.6516 0.9814 1.0533 1.8502 14.5682 33.0701 61.8942 6.2714 2.7833 10.7339 8.6744 2.3505 2.3108 0.3116 5.6815 2.8720 4.2563 0.3917 6.1410 0.7372 8.9476 6.1886 1.6616 4.6013 4.1394 42.8239 57.0079 35.3900 18.1810 19.1939 1.2162 43.0048 5.1487 0.3722 14.9119 0.6321 19.4044 0.4612 8.4544 4.5752 12.7172 3.5776 41.4193 39.0486 15.5579 4.1364 1.9173 1.7315 13.4670 4.8629 14.8217 15.7188 14.9050 8.1918 16.1487 5.6934 2.4260 8.0029 3.7157 25.4004 9.3126 0.7911 6.7540 12.6283 5.5543 7.0513 0.3653 0.3872 1.9984 5.5220 2.3269 4.1827 4.3711 7.4066 26.5138 10.2232 27.2306 14.8377 21.5073 0.7523 5.0130 7.2807 5.6249 0.9297 15.2671 1.2611 14.2743 6.7275 2.2124 16.9296 17.3243 12.0860 6.4627 3.7852 3.7339 2.2828 23.3125 67.5975 1.7393 10.8776 9.8956 11.6541 11.9128 6.9235 7.7451 26.4287 5.0571 23.6694 0.4777 1.8738 17.4632 11.0804 44.8068 80.8018 192.4534 9.0089 10.2879 28.1523 18.6144 34.1902 44.0930 68.2756 45.0348 28.4174 33.2902 26.3933 9.1149 39.5862 22.8397 1.7347 5.1233 2.4964 13.5587 12.7729 32.1299 27.8059 30.3827 21.1502 6.9770
temp: 298.150 k
press: 1.00000 atm
elementType: 8 7 7 7 6 6 6 6 6 6 6 6 6 6 6 6 6 6 6 6 6 6 6 6 6 6 6 6 1 1 1 1 1 1 1 1 1 1 1 1 1 1 1 1 1 1 1 1 1 1 1 1 1 1 1
symmnumber: 1
zpe: 1201263.9 jmol-1
zpe.correction: 0.457537 hartree
zpe.thermalcorrener: 0.482482 hartree
zpe.thermalcorrenthalpy: 0.483426 hartree
zpe.thermalcorrgfe: 0.402773 hartree
zpe.sumelectzpe: -1168.185646 hartree
zpe.sumelectthermal: -1168.160702 hartree
zpe.sumelectthermalent: -1168.159758 hartree
zpe.sumelectthermalfe: -1168.240411 hartree
dipole: -2.3764 -1.5041 0.7916
dipole: 2.9216
quadrupole: -157.4744 -152.3509 -162.1187
quadrupole: 12.1943 2.7945 -6.9217
quadrupole: -0.1597 4.9638 -4.8040 12.1943 2.7945 -6.9217
hfenergy: -1168.6431833 hartree
pointgroup: C01 [X(C24H27N3O1)]
dipole: -0.8122376 -0.7433898 0.329974 debye
polarizability: 366.2441334|42.6312548|285.4423812|26.8618774|-44.0249073|217.1080908 unknown
InChI: InChI=1S/C24H27N3O/c1-3-27-23-19-11-7-8-12-20(19)24(28,18-13-15-26(2)16-14-18)21(23)22(25-27)17-9-5-4-6-10-17/h4-12,18,28H,3,13-16H2,1-2H3
charge 0 multiplicity 1
55 atoms
O  -0.164237 0.430586 -2.430359
N  -1.749258 3.880965 1.047388
N  0.429632 -2.736131 0.89543
N  1.728209 -2.214638 0.900213
C  -0.627858 1.536862 -0.334519
C  -0.591453 0.139783 -1.035683
C  -1.067369 1.477579 1.147801
C  -1.490247 2.590964 -1.068411
C  0.325326 -0.842243 -0.309027
C  -1.933966 -0.644954 -1.009842
C  -0.950216 2.87575 1.788138
C  -1.341228 3.960085 -0.376004
C  -0.422241 -1.926359 0.181677
C  -1.820999 -1.853214 -0.242014
C  1.66236 -1.043201 0.156548
C  -3.143203 -0.335495 -1.649462
C  -2.92404 -2.713973 -0.073917
C  -1.730116 5.199522 1.707464
C  0.14372 -3.960651 1.65717
C  2.88492 -0.246439 -0.061506
C  -4.254619 -1.207664 -1.492145
C  -4.148425 -2.376337 -0.703377
C  -0.547376 -3.670172 3.005271
C  4.03996 -0.466841 0.738564
C  2.933921 0.742603 -1.082703
C  5.21081 0.289774 0.529251
C  4.10814 1.498919 -1.286661
C  5.250639 1.279797 -0.482258
H  0.423573 1.894308 -0.359166
H  -0.438676 0.766734 1.716172
H  -2.118173 1.137159 1.21521
H  -2.557072 2.30298 -1.027204
H  -1.185841 2.664619 -2.127142
H  -1.316227 2.843781 2.832044
H  0.134578 3.167759 1.82532
H  -0.277772 4.309593 -0.477009
H  -1.981635 4.709737 -0.878782
H  -0.06534 -0.435803 -2.902406
H  -3.226726 0.556075 -2.277548
H  -2.845519 -3.632274 0.518405
H  -0.708082 5.656398 1.756913
H  -2.110617 5.105268 2.740828
H  -2.389527 5.899139 1.162361
H  -0.480968 -4.625164 1.032054
H  1.11556 -4.455115 1.815714
H  -5.202881 -0.972208 -1.987618
H  -5.016979 -3.033969 -0.586872
H  0.088372 -3.021466 3.631853
H  -0.72594 -4.614875 3.549844
H  -1.519748 -3.166794 2.859688
H  4.001273 -1.234333 1.51817
H  2.061386 0.896334 -1.729018
H  6.092991 0.110782 1.154652
H  4.133123 2.255158 -2.079636
H  6.160782 1.868798 -0.642854
