program: Gaussian 09
title: 000015146
version: EM64L-G09RevD.01
frameworkgroup: C1[X(C5H10O3)]
method: RPBEPBE
basis: SDD
operation: Freq
keyword: #pfreq=noraman
keyword: PBEPBE/SDD
title: #p freq=noraman PBEPBE/SDD
converged: YES YES NO NO
title: Mulliken charges:
elementType: O O O C C C C C H H H H H H H H H H
charge: -0.458973 -0.264232 -0.250791 -0.028379 -0.492630 -0.697536 0.276769 -0.504615 0.222063 0.225651 0.259350 0.231602 0.213165 0.210567 0.341827 0.232653 0.238463 0.245047
chargesum: 0.00000
title: Mulliken charges with hydrogens summed into heavy atoms:
elementType: O O O C C C C C
charge: -0.117146 -0.264232 -0.250791 0.193684 -0.007630 -0.042202 0.276769 0.211547
polarizability: 8.00471460e+01 1.00620384e+00 5.68216034e+01 -4.21097782e+00 2.25621041e+00 5.64794936e+01
1716.lowfreq: -11.7033 -0.0003 -0.0003 0.0008 5.1647 10.4080 39.1981 67.2789 84.0268
frequency: 38.9004 67.2634 83.9671 129.6933 186.3567 237.6638 258.0108 275.0988 308.7044 368.7832 436.8934 453.6678 571.5087 676.2377 816.5876 834.8315 886.8801 925.8672 974.8179 1056.5193 1081.6404 1089.4292 1112.4988 1146.8707 1149.6170 1194.8398 1256.7954 1299.0518 1336.1050 1383.3485 1389.9523 1421.8092 1425.8657 1451.7385 1463.7067 1468.9999 1473.8492 1647.7110 2976.5329 2980.0428 3004.4195 3010.2151 3070.7945 3085.7079 3094.7818 3106.3602 3148.8440 3570.3703
redmass: 3.7989 2.5877 1.2499 3.2424 3.9081 1.0764 1.4304 2.2702 2.7791 2.7660 3.2068 2.8978 3.6126 4.7651 3.5235 4.8863 1.8211 2.0822 3.4393 2.1457 1.7893 2.0723 1.2733 1.9646 1.6817 1.4507 1.2134 1.5131 1.3810 1.5941 1.2282 1.1840 1.1028 1.0503 1.0503 1.0674 1.0535 9.2383 1.0568 1.0635 1.0296 1.0629 1.0987 1.0998 1.0976 1.1045 1.1048 1.0663
irintensity: 5.0008 0.3653 0.3784 8.3010 5.8799 2.1324 108.8955 53.5624 1.2010 13.7188 10.5958 16.0193 6.8435 8.5717 20.3478 7.5878 7.8122 4.7448 37.7622 9.5945 85.1669 67.8931 0.2948 62.2692 66.4308 101.3977 19.6147 35.7238 26.4055 38.5581 16.3253 18.1180 27.0488 13.8502 11.2010 11.6272 8.9610 173.5547 23.5254 25.3228 31.1535 8.2725 38.0113 18.8779 21.9941 27.9603 17.2549 4.9375
temp: 298.150 k
press: 1.00000 atm
elementType: 8 8 8 6 6 6 6 6 1 1 1 1 1 1 1 1 1 1
symmnumber: 1
zpe: 385377.9 jmol-1
zpe.correction: 0.146783 hartree
zpe.thermalcorrener: 0.156859 hartree
zpe.thermalcorrenthalpy: 0.157804 hartree
zpe.thermalcorrgfe: 0.110848 hartree
zpe.sumelectzpe: -421.534785 hartree
zpe.sumelectthermal: -421.524708 hartree
zpe.sumelectthermalent: -421.523764 hartree
zpe.sumelectthermalfe: -421.570720 hartree
dipole: -0.8892 -0.7981 0.0483
dipole: 1.1958
quadrupole: -35.1802 -45.9745 -54.1543
quadrupole: -1.7600 -3.6140 -1.4541
quadrupole: 9.9228 -0.8715 -9.0513 -1.7600 -3.6140 -1.4541
hfenergy: -421.6815674 hartree
pointgroup: C01[X(C5H10O3)]
dipole: 0.3402247 -0.3181725 -0.065996 debye
dipolederiv: -0.4628626 0.1910739 -0.1373911 0.1720118 -0.6171203 -0.2242177 -0.1415427 -0.2595555 -0.5623056 -1.2896532 -0.0528423 0.3373817 -0.0755387 -0.4069119 0.1571922 0.4357509 0.132734 -0.5735305 -0.6593826 0.1160703 -0.0712378 -0.0830259 -0.5816274 0.3358853 0.187835 0.2566695 -0.6917758 0.5192458 -0.0364916 0.0530967 0.0399852 0.5290271 0.2128538 -0.0009411 0.2081528 0.455107 -0.3546729 0.043572 -0.0286591 0.0960439 -0.0747016 0.0518546 0.0533814 0.0572609 0.077581 -0.1719365 0.1348095 0.0172017 0.047544 -0.0292952 -0.0375474 -0.0246789 -0.0307598 0.0387338 1.479479 -0.0821192 -0.2398721 0.095882 0.6427843 -0.5271521 -0.5782812 -0.4263531 0.9052777 0.5867909 -0.0266544 -0.0674236 -0.0953284 0.2593926 0.0466885 0.0164005 0.0293228 0.2497063 0.0547948 0.0212539 -0.0184235 -0.0084716 -0.0413433 0.0655669 -0.0006243 0.0336304 -0.1448765 0.0593742 0.0277724 0.0045825 0.0184455 -0.0049804 -0.0827107 -0.0084503 -0.1124528 0.0152904 0.0684257 -0.0010877 -0.0042889 -0.0071349 0.0868593 0.053057 -0.0000566 0.0847386 -0.0328011 0.0766275 0.0013332 0.0213236 0.0387301 0.0304058 0.093236 -0.0390276 0.1210044 -0.073024 -0.1190304 -0.0907633 0.0106188 -0.1457981 -0.0280034 0.0128148 0.0117536 0.0151609 0.1001605 0.0894872 0.0083471 -0.0078077 0.0379991 -0.0225129 -0.1322395 0.0152738 -0.1372456 -0.0590481 0.1583286 -0.1965433 0.0651549 -0.1690668 0.2193069 0.0157171 0.1089345 0.0393668 0.2708923 -0.0248398 -0.0297317 0.0793434 -0.0588051 0.0717334 0.0745752 0.1151997 0.0646325 0.0107594 -0.0135667 0.0093555 -0.0137386 0.0331351 0.0759607 -0.056326 -0.122723 -0.0510488 -0.0828668 0.0033911 -0.0373542 0.0001392 0.0633929 -0.1089738 -0.0592479 -0.0282038 -0.0252579 0.0967201 unknown
polarizability: 80.1170912|-1.0282808|57.5937363|-4.0534006|-1.9442635|55.6374156 unknown
InChI: InChI=1S/C5H10O3/c1-4(6)3-5(7)8-2/h4,6H,3H2,1-2H3
charge 0 multiplicity 1
18 atoms
O  1.584445 0.958009 0.953453
O  -1.860791 -0.57786 0.478712
O  -0.988945 0.697398 -1.26281
C  1.685615 0.025439 -0.192342
C  0.463075 -0.893441 -0.045166
C  3.014589 -0.747841 -0.161917
C  -0.827776 -0.155573 -0.360393
C  -3.177946 0.063274 0.243542
H  1.590056 0.589523 -1.143942
H  0.552422 -1.742863 -0.749556
H  0.417703 -1.301301 0.977878
H  3.113057 -1.311011 0.783347
H  3.874605 -0.056533 -0.239388
H  3.080287 -1.459795 -1.005971
H  2.239239 1.691202 0.834726
H  -3.848427 -0.393422 0.984794
H  -3.523964 -0.136113 -0.784833
H  -3.100542 1.153009 0.393765
