program: Gaussian 09
title: 000210984
version: EM64L-G09RevD.01
frameworkgroup: C1[X(C18H21NO2)]
method: RPBEPBE
basis: SDD
operation: Freq
keyword: #p
keyword: freq=noraman
keyword: PBEPBE/SDD
title: #p freq=noraman PBEPBE/SDD
converged: YES YES NO NO
title: Mulliken charges:
elementType: O O N C C C C C C C C C C C C C C C C C C H H H H H H H H H H H H H H H H H H H H H
charge: -0.164425 -0.162685 -0.097997 0.032420 -0.033550 -0.027755 -0.496575 0.253498 0.255362 -0.733636 -0.374735 -0.374749 -0.007468 -0.211524 -0.208248 -0.402955 -0.310779 -0.303124 -0.050327 -0.693775 -0.691646 0.253640 0.254404 0.240857 0.240998 0.232068 0.277289 0.278001 0.240327 0.239277 0.234594 0.210537 0.176672 0.236520 0.174260 0.209512 0.236434 0.204227 0.210653 0.231615 0.211179 0.211609
chargesum: 0.00000
title: Mulliken charges with hydrogens summed into heavy atoms:
elementType: O O N C C C C C C C C C C C C C C C C C C
charge: -0.164425 -0.162685 -0.097997 0.032420 -0.033550 -0.027755 0.011469 0.253498 0.255362 -0.019713 -0.097445 -0.096748 -0.007468 0.028804 0.031029 0.042175 0.102413 0.080648 -0.050327 -0.042461 -0.037243
polarizability: 1.97551484e+02 -3.20117783e+01 2.09187838e+02 6.01370386e-01 -1.52536642e+00 1.91811724e+02
1716.lowfreq: -13.0064 -7.5435 -2.3534 -0.0009 -0.0006 -0.0004 10.9952 16.9432 26.9281
frequency: -6.3141 16.3358 26.6846 35.2197 48.8474 57.5907 78.1337 110.2484 122.1712 158.5759 168.4373 185.3204 189.1848 212.3293 218.5462 221.9641 231.0373 249.0788 250.9371 269.5577 283.8283 323.8448 328.8682 353.4866 373.1846 415.1769 436.6008 450.1055 470.5475 490.3445 522.5039 541.0116 552.7743 660.6188 671.2309 677.3254 725.1222 734.3059 777.6105 788.9933 799.8383 800.5940 804.0810 809.7564 884.7213 905.4329 909.8707 913.2427 956.3985 971.3492 981.5014 985.1783 989.4531 1012.6287 1016.7065 1057.3824 1074.3323 1082.1739 1086.9329 1094.9681 1114.5184 1123.5071 1155.3805 1160.6103 1168.6867 1182.9120 1184.3149 1194.4868 1241.1599 1245.4941 1249.7300 1277.7172 1285.3110 1286.8748 1316.9273 1355.5746 1362.4448 1374.5759 1381.8401 1384.1887 1387.3841 1408.2917 1440.2921 1452.7082 1453.6480 1456.0755 1464.8968 1467.5055 1468.5398 1472.0020 1475.9180 1476.0249 1486.2380 1491.7891 1590.3360 1597.9511 1629.2292 1655.0741 2285.1729 2813.9241 2832.2724 2850.6778 2980.3567 2982.3551 2986.0414 2987.7989 3024.4098 3034.5959 3036.5020 3044.0619 3075.3745 3078.8963 3088.4419 3088.6986 3093.3623 3095.7394 3136.0028 3149.7928 3161.3717 3171.2569
redmass: 3.3574 4.7374 4.7845 5.0002 3.1323 2.4526 2.2136 2.6096 4.7618 5.5414 3.8582 1.4425 1.3165 2.2517 1.5228 2.2524 4.0040 3.0178 3.1752 2.5216 2.0294 5.0687 4.8167 3.0563 4.8850 3.2220 3.1900 4.2767 2.9344 4.6178 7.2223 8.6947 6.3770 4.4451 4.3341 6.1427 2.5175 3.0613 3.3173 1.4897 2.4222 2.0035 1.2435 2.2449 3.7353 2.2094 1.9171 2.1274 1.8219 2.3585 1.7962 1.6536 1.8261 1.3600 1.9460 2.7218 1.8952 2.4181 2.1338 4.6497 1.8675 1.7267 2.1085 1.9232 1.6786 1.9750 2.0539 2.4243 1.2980 1.7333 2.0861 1.1593 1.6350 1.1822 1.6875 1.3955 1.3200 1.3875 1.2234 1.2313 1.2241 7.1719 1.0949 2.5383 2.4742 1.0796 1.0572 1.0727 1.0497 1.0534 1.0549 1.0640 1.0560 1.0704 7.6581 7.6793 10.0688 11.9140 11.7465 1.0714 1.0722 1.0708 1.0576 1.0352 1.0358 1.0342 1.0833 1.0877 1.1022 1.0870 1.0983 1.0973 1.1003 1.1002 1.1003 1.1013 1.0863 1.0901 1.0956 1.1004
irintensity: 0.2388 0.7440 0.8177 3.4017 0.8066 0.3072 2.6569 1.6114 0.0498 1.6951 1.0568 0.2865 0.8245 1.6260 1.3916 4.7222 0.3360 3.0944 1.0704 0.9299 4.1294 8.4074 2.1882 5.0493 1.9362 2.2521 8.0229 0.0182 0.7315 12.4199 0.6470 6.1204 8.7921 0.0098 0.1185 2.4367 48.7637 8.9397 0.6252 2.9884 8.3353 26.2632 17.6662 5.7348 5.0096 2.0312 1.3985 1.3943 1.3839 3.2684 26.1646 12.5874 8.1228 0.0334 1.6854 21.5485 18.7468 0.8563 2.8649 3.8592 21.7566 0.5361 4.3083 23.2049 12.0437 2.1508 0.2293 27.7448 11.1018 47.0423 90.2492 17.9823 3.0596 13.5173 53.8799 13.5453 9.4338 4.4512 28.4847 18.1886 23.3465 10.2661 9.5233 0.3738 0.1810 3.7325 3.7526 21.7619 11.2304 7.0723 8.1870 3.9214 11.0400 11.3390 159.2453 0.2635 133.9465 73.5809 0.1584 59.8964 73.5957 204.0575 25.1776 26.1593 27.5427 26.4856 13.4441 3.6353 2.6120 7.4737 27.1478 77.1119 48.0541 25.5061 34.7498 8.9683 1.6513 4.2092 5.8102 22.0170
temp: 298.150 k
press: 1.00000 atm
elementType: 8 8 7 6 6 6 6 6 6 6 6 6 6 6 6 6 6 6 6 6 6 1 1 1 1 1 1 1 1 1 1 1 1 1 1 1 1 1 1 1 1 1
symmnumber: 1
zpe: 900079.2 jmol-1
zpe.correction: 0.342822 hartree
zpe.thermalcorrener: 0.363978 hartree
zpe.thermalcorrenthalpy: 0.364922 hartree
zpe.thermalcorrgfe: 0.291274 hartree
zpe.sumelectzpe: -902.096021 hartree
zpe.sumelectthermal: -902.074866 hartree
zpe.sumelectthermalent: -902.073922 hartree
zpe.sumelectthermalfe: -902.147569 hartree
dipole: -1.7532 2.5131 0.0165
dipole: 3.0642
quadrupole: -117.3653 -110.3772 -134.9791
quadrupole: 0.8519 1.7999 -2.1274
quadrupole: 3.5419 10.5300 -14.0719 0.8519 1.7999 -2.1274
hfenergy: -902.4388434 hartree
pointgroup: C01 [X(C18H21N1O2)]
dipole: -0.7297834 0.9556627 -0.0865928 debye
polarizability: 200.3414512|-32.0865227|206.2347302|4.6719177|-1.7620105|191.9748639 unknown
InChI: InChI=1S/C18H21NO2/c1-4-19(5-2)13-9-8-12-18(3)16(20)14-10-6-7-11-15(14)17(18)21/h6-7,10-11H,4-5,12-13H2,1-3H3
charge 0 multiplicity 1
42 atoms
O  1.956966 -0.018193 2.360332
O  2.363154 -0.967845 -2.376359
N  -3.073716 -0.554504 0.273083
C  2.388693 -1.027034 0.118288
C  1.910423 0.067852 1.10555
C  2.111481 -0.410971 -1.276601
C  1.5794 -2.353563 0.31796
C  1.406694 1.225068 0.309585
C  1.522181 0.945713 -1.077562
C  3.900273 -1.31753 0.30326
C  0.877962 2.451429 0.763906
C  1.112723 1.88524 -2.046604
C  0.121524 -2.195366 0.177819
C  0.466869 3.395128 -0.204081
C  0.583155 3.114981 -1.595139
C  -2.558294 -1.908373 -0.086778
C  -2.792955 -0.215914 1.697789
C  -4.515893 -0.431179 -0.074425
C  -1.097342 -2.044087 0.061905
C  -2.896211 1.293152 1.986946
C  -4.77703 -0.347263 -1.591104
H  1.826113 -2.742545 1.325063
H  1.952638 -3.082962 -0.427447
H  4.084733 -1.702552 1.321605
H  4.228794 -2.067417 -0.437788
H  4.509974 -0.407274 0.164155
H  0.793424 2.653922 1.836372
H  1.204343 1.655288 -3.112732
H  0.050977 4.357191 0.114904
H  0.253718 3.866229 -2.321284
H  -2.822669 -2.105556 -1.141981
H  -3.05445 -2.711549 0.521992
H  -3.464163 -0.785491 2.392119
H  -1.759825 -0.544331 1.911666
H  -5.114063 -1.27193 0.367265
H  -4.888382 0.497654 0.391898
H  -2.225633 1.849299 1.308482
H  -3.922109 1.681929 1.85372
H  -2.595939 1.499107 3.031157
H  -4.173962 0.465054 -2.032722
H  -4.527349 -1.285488 -2.118596
H  -5.845929 -0.138217 -1.782218
