program: Gaussian 09
title: 000210982
version: EM64L-G09RevD.01
frameworkgroup: C1[X(C24H23NO3)]
method: RPBEPBE
basis: SDD
operation: Freq
keyword: #p
keyword: freq=noraman
keyword: PBEPBE/SDD
title: #p freq=noraman PBEPBE/SDD
converged: NO YES NO NO
title: Mulliken charges:
elementType: O O O N C C C C C C C C C C C C C C C C C C C C C C C C H H H H H H H H H H H H H H H H H H H H H H H
charge: -0.167193 -0.165540 -0.249517 -0.075789 0.067659 -0.631748 -0.045922 -0.044437 -0.511789 0.267406 0.280982 0.477821 -0.386513 -0.390575 -0.012278 -0.344574 -0.347685 -0.412654 -0.408448 -0.408054 -0.217231 -0.210026 -0.314719 -0.321584 -0.046148 -0.237608 -0.237763 -0.240133 0.237306 0.236564 0.257647 0.258934 0.281464 0.282181 0.242384 0.188894 0.190174 0.212005 0.236913 0.220216 0.255242 0.254812 0.242963 0.243258 0.209555 0.194131 0.195842 0.213789 0.225961 0.225821 0.228002
chargesum: 0.00000
title: Mulliken charges with hydrogens summed into heavy atoms:
elementType: O O O N C C C C C C C C C C C C C C C C C C C C C C C C
charge: -0.167193 -0.165540 -0.249517 -0.075789 0.067659 -0.157879 -0.045922 -0.044437 0.004792 0.267406 0.280982 0.477821 -0.105049 -0.108394 -0.012278 0.086704 0.054494 0.044476 -0.153206 -0.153242 0.025733 0.033232 0.088967 0.088048 -0.046148 -0.011647 -0.011942 -0.012131
polarizability: 2.87483926e+02 -2.00694892e-01 2.54511055e+02 4.20685960e+00 1.39635674e-03 2.30524163e+02
1716.lowfreq: -7.8086 -5.1177 -0.9683 -0.0004 -0.0002 0.0003 6.1421 14.0553 25.0226
frequency: 3.7757 13.6874 24.9642 29.9087 41.7347 48.1976 55.9854 66.8187 95.6857 123.4990 134.3213 145.4034 156.5769 172.4714 198.7579 207.9692 226.9037 237.0422 242.4407 250.4385 298.6938 310.1480 325.7207 335.7574 340.0704 362.1301 389.6359 405.8541 409.8138 432.9284 449.7807 469.0548 476.7078 507.0362 522.9980 543.8526 547.0681 579.7953 602.6981 617.6590 658.6082 666.5907 678.0766 706.6380 731.7101 759.4709 762.2547 775.5525 782.4710 792.4128 805.2314 808.2504 831.8754 842.0685 859.8776 901.0108 904.8721 908.6593 909.5888 924.9918 935.3747 976.0021 982.0913 982.9619 990.2077 993.4355 996.9952 1013.3514 1013.9543 1025.8722 1027.1729 1034.7484 1047.1243 1052.2574 1082.4283 1082.5783 1093.9940 1099.3338 1111.9600 1131.9971 1147.4111 1169.4299 1172.5031 1175.1934 1183.5748 1188.0285 1189.3861 1192.2874 1217.8835 1219.0646 1244.6764 1260.2339 1264.4601 1272.0162 1276.9565 1288.5956 1289.3833 1323.5068 1336.0263 1337.0396 1346.1376 1356.8949 1368.8172 1382.2949 1382.8422 1406.9669 1438.5178 1441.5120 1442.7064 1446.0401 1449.3288 1452.5179 1453.8841 1454.7393 1461.9905 1464.9257 1484.9253 1589.6008 1592.1533 1596.5453 1613.9908 1628.0375 1654.5451 2285.6963 2826.6817 2852.0670 2864.6162 2954.4212 2960.1055 2975.4380 2993.2245 2999.7204 3021.1286 3031.5140 3050.7496 3055.5620 3080.3799 3083.5777 3120.5409 3124.5407 3136.0244 3136.5147 3146.2467 3150.6944 3162.4179 3162.5594 3171.7120
redmass: 4.1089 4.2217 6.1521 4.3423 5.7398 4.0009 6.0067 4.4922 6.8698 4.4491 5.3745 4.3520 6.6377 5.0557 4.7201 3.8987 2.4461 6.0776 1.8917 5.5376 2.3968 4.4484 9.2330 2.0772 4.8431 4.1408 1.8850 2.8432 4.0757 3.9671 4.2725 2.9820 4.9362 4.7848 7.2781 8.0307 5.4795 4.8404 2.0570 6.2980 4.5687 4.2565 6.0396 2.0361 1.9947 3.7804 2.3126 3.4423 2.7413 3.7700 3.8723 2.0508 3.7378 1.6237 1.2424 2.2501 1.7275 3.2624 3.3788 1.9191 1.8581 1.8203 1.3822 1.4537 5.8858 2.8015 1.3216 2.0369 1.3673 2.9680 2.1359 3.5850 2.1280 2.0301 2.7340 3.0400 1.6379 2.4177 2.5285 3.7425 2.6412 1.6844 1.0552 1.7231 1.9950 1.0800 1.0737 1.1439 1.1701 2.4515 3.7684 1.3229 1.4268 1.4000 1.3608 1.2513 1.6080 1.3215 1.2529 1.2248 1.6136 1.4102 1.2713 7.1631 1.4940 7.7135 1.0970 1.0839 2.1616 1.0849 1.1053 2.1965 2.2838 1.1762 1.1484 1.0984 2.2510 7.6225 6.0394 7.6685 6.0194 10.1178 11.9828 11.7522 1.0705 1.0707 1.0690 1.0664 1.0663 1.0574 1.0585 1.0851 1.0892 1.1023 1.0881 1.1034 1.0963 1.0980 1.0847 1.0879 1.0923 1.0864 1.0964 1.0902 1.0956 1.1016 1.1003
irintensity: 0.8261 0.1177 0.8877 0.0548 2.2830 0.1269 0.3230 0.0299 6.3582 0.5440 2.3246 0.4253 3.6144 1.5010 0.2329 2.0225 5.6928 0.8818 1.2904 0.3434 13.6558 5.6364 8.1884 0.8646 2.6450 0.9334 0.3500 0.0184 0.8449 0.5502 0.0860 1.3396 19.2593 12.0921 0.7931 8.1728 31.6647 6.1460 2.1199 0.0332 0.0078 0.0303 0.1244 54.3846 24.1032 5.7068 56.1710 0.3564 18.5398 0.0211 23.7567 35.9751 0.4315 0.4051 1.0334 13.8683 2.1086 5.3398 4.4023 0.0443 21.9858 1.6320 0.7128 4.3152 0.4615 33.5901 1.1600 0.1468 0.0250 8.1982 8.3615 0.4437 2.7015 25.9503 18.0385 35.5324 11.5093 9.5154 17.2750 4.4762 6.8425 25.4376 0.0291 2.7094 3.2666 2.0294 0.1789 2.2949 8.5941 5.8474 124.0858 19.1638 3.0658 16.0967 3.4457 2.3413 0.3423 35.3323 0.6873 17.0141 56.7104 3.4269 1.3515 0.1608 11.8074 7.2475 5.9694 3.0684 9.4231 1.3659 11.7093 0.4638 0.6096 2.8645 20.7903 10.2712 17.3978 133.1673 2.4649 0.1775 7.4136 104.6205 80.8190 0.9390 54.1099 60.5867 136.6319 49.7453 78.0600 20.1978 30.5377 16.6837 50.3396 1.6949 23.8549 5.5122 45.1068 27.2927 2.6493 0.3891 15.1846 1.7602 28.8100 3.9308 3.4781 23.2222 18.4193
temp: 298.150 k
press: 1.00000 atm
elementType: 8 8 8 7 6 6 6 6 6 6 6 6 6 6 6 6 6 6 6 6 6 6 6 6 6 6 6 6 1 1 1 1 1 1 1 1 1 1 1 1 1 1 1 1 1 1 1 1 1 1 1
symmnumber: 1
zpe: 1071206.5 jmol-1
zpe.correction: 0.408001 hartree
zpe.thermalcorrener: 0.433160 hartree
zpe.thermalcorrenthalpy: 0.434105 hartree
zpe.thermalcorrgfe: 0.348254 hartree
zpe.sumelectzpe: -1206.694104 hartree
zpe.sumelectthermal: -1206.668945 hartree
zpe.sumelectthermalent: -1206.668001 hartree
zpe.sumelectthermalfe: -1206.753851 hartree
dipole: -0.4468 1.4206 0.4511
dipole: 1.5560
quadrupole: -161.0916 -150.7679 -168.9173
quadrupole: 13.1789 0.2885 1.0676
quadrupole: -0.8326 9.4910 -8.6584 13.1789 0.2885 1.0676
hfenergy: -1207.1021054 hartree
pointgroup: C01 [X(C24H23N1O3)]
dipole: 0.179713 0.5714785 -0.1260365 debye
polarizability: 286.9142469|-0.0521959|254.3754464|7.0512713|1.8155535|231.2294503 unknown
InChI: InChI=1S/C24H23NO3/c26-22-20-10-4-5-11-21(20)23(27)24(22,18-19-8-2-1-3-9-19)12-6-7-13-25-14-16-28-17-15-25/h1-5,8-11H,12-18H2
charge 0 multiplicity 1
51 atoms
O  -1.171005 -0.844394 -2.576741
O  -1.029216 -0.876385 2.266418
O  5.560631 1.756451 0.480524
N  4.186189 -0.790453 0.299262
C  -1.278546 -1.426242 -0.153373
C  -2.779337 -1.873007 -0.108737
C  -0.984469 -0.520412 -1.375163
C  -0.906733 -0.538572 1.060804
C  -0.386479 -2.715307 -0.187895
C  -0.450969 0.778315 -0.873482
C  -0.40491 0.767485 0.545653
C  -3.787246 -0.731745 -0.066523
C  -0.034816 1.908826 -1.607337
C  0.060406 1.885885 1.267982
C  1.062592 -2.460074 -0.245816
C  3.653516 0.417642 -0.381633
C  5.666881 -0.724544 0.395266
C  3.738537 -2.054419 -0.344609
C  -4.232972 -0.203985 1.173528
C  -4.305105 -0.178911 -1.267018
C  0.432032 3.031453 -0.887015
C  0.480067 3.019669 0.536226
C  4.092861 1.675713 0.381609
C  6.077125 0.551005 1.149982
C  2.278563 -2.255961 -0.282442
C  -5.170046 0.852981 1.21317
C  -5.242093 0.878144 -1.229791
C  -5.67772 1.398395 0.011096
H  -2.894413 -2.514582 0.785578
H  -2.952261 -2.499204 -1.00467
H  -0.696507 -3.308395 -1.071033
H  -0.626581 -3.305526 0.718533
H  -0.07903 1.904866 -2.700967
H  0.089992 1.863901 2.361822
H  2.550626 0.359158 -0.399189
H  4.015494 0.481626 -1.439936
H  6.150067 -0.721772 -0.615603
H  6.03364 -1.610817 0.948115
H  4.237525 -2.892605 0.180979
H  4.063201 -2.107714 -1.417454
H  -3.844502 -0.625531 2.108516
H  -3.97335 -0.582006 -2.231536
H  0.759996 3.927123 -1.425942
H  0.845616 3.905936 1.066357
H  3.782928 2.590644 -0.149778
H  3.647388 1.66428 1.399888
H  5.688686 0.504889 2.190055
H  7.173273 0.669115 1.166038
H  -5.507262 1.245523 2.179201
H  -5.635699 1.290039 -2.165983
H  -6.408268 2.214698 0.041064
