program: Gaussian 09
title: 000216347
version: EM64L-G09RevD.01
frameworkgroup: C1[X(C16H22N2O2)]
method: RPBEPBE
basis: SDD
operation: Freq
keyword: #p
keyword: freq=noraman
keyword: PBEPBE/SDD
title: #p freq=noraman PBEPBE/SDD
converged: YES YES NO NO
title: Mulliken charges:
elementType: O O N N C C C C C C C C C C C C C C C C H H H H H H H H H H H H H H H H H H H H H H
charge: -0.336222 -0.280000 -0.074918 -0.376750 0.208596 -0.195401 -0.528973 -0.601936 0.339166 -0.458411 0.236090 -0.780561 -0.314931 -0.549354 -0.376922 0.357398 -0.687158 -0.429565 0.293839 -0.607621 0.213260 0.213636 0.240922 0.223286 0.255751 0.234856 0.220337 0.225291 0.224053 0.212246 0.178642 0.212235 0.313269 0.242262 0.227239 0.210746 0.203759 0.249145 0.330471 0.229977 0.230116 0.272137
chargesum: 0.00000
title: Mulliken charges with hydrogens summed into heavy atoms:
elementType: O O N N C C C C C C C C C C C C C C C C
charge: -0.336222 -0.280000 -0.074918 -0.046280 0.208596 0.017858 -0.074416 -0.122899 0.339166 -0.003219 0.236090 -0.118972 0.075947 -0.236086 -0.134660 0.357398 -0.045413 -0.180420 0.293839 0.124609
polarizability: 2.69292721e+02 -2.08716347e+00 1.83448201e+02 -7.56077889e+00 -7.29409800e+00 1.29937778e+02
1716.lowfreq: -2.5730 -0.0009 -0.0002 0.0004 4.0588 8.2177 17.2584 20.1330 38.1658
frequency: 15.1404 19.8964 38.1273 60.9507 85.6713 91.2476 98.8463 115.4483 147.3051 170.3204 193.6372 200.9624 225.9877 236.7008 250.8699 265.3684 300.2351 303.5764 318.3947 323.1428 343.7979 361.0877 416.8752 451.5003 497.1065 520.4523 553.5637 569.2976 581.1522 615.8314 623.0963 634.2794 674.6224 685.3578 713.7999 726.1059 753.0076 769.2764 798.3622 820.1941 841.4049 860.0452 873.5750 898.7669 918.5648 925.4561 936.9862 946.5642 964.4467 971.5619 1003.8357 1023.6756 1051.5649 1058.6248 1075.9479 1091.2819 1097.8622 1103.7352 1106.3960 1126.6188 1134.1091 1142.7835 1145.2675 1163.3534 1179.4524 1185.6210 1195.4320 1200.0519 1219.7748 1240.5940 1254.2225 1274.0166 1287.8686 1293.6757 1299.1590 1316.1102 1329.0372 1370.7332 1380.0200 1385.5153 1387.1497 1420.7767 1430.8096 1454.2469 1457.2026 1462.1373 1462.4721 1468.3737 1472.1021 1474.7145 1481.0500 1483.6687 1484.4093 1487.3081 1513.2223 1596.7310 1611.4521 1683.5762 2851.6858 2968.4493 2980.1871 2980.4953 2981.5450 2992.1404 2994.5223 3014.7886 3026.3547 3043.3618 3057.6401 3062.0868 3065.5771 3069.0395 3073.1797 3077.6618 3090.8305 3113.7055 3130.1392 3165.0899 3185.6756 3579.0130
redmass: 5.2301 3.7372 3.9104 3.5928 2.6321 3.4945 1.1340 2.6703 2.5538 3.5832 2.9952 2.6411 1.3337 1.4332 2.0398 3.0182 2.8139 3.2002 3.8260 3.0907 3.3895 4.8560 2.5999 2.8009 2.5329 4.2038 4.4179 2.9553 1.1578 4.2471 3.7961 4.6773 5.5356 11.9241 2.7203 4.3747 3.5349 4.3571 1.2023 1.4117 2.3641 2.9239 2.8611 2.4694 1.4276 3.1205 2.0002 1.4748 1.7056 2.3031 1.9651 2.1051 2.5763 2.2667 2.3350 3.6845 1.8305 2.0662 2.0516 1.2820 1.5579 1.4002 1.5373 2.4306 2.0798 1.6514 2.1996 2.1114 1.8579 1.4617 1.5535 1.6620 1.4853 1.4876 1.6809 1.2993 1.4515 1.3254 3.8711 1.4131 1.2453 3.7841 1.1832 1.1828 1.3460 1.0824 1.0599 1.0513 1.0606 1.1831 1.8335 1.1248 1.0441 1.0741 1.3901 8.2103 7.0652 9.1845 1.0705 1.0351 1.0381 1.0600 1.0369 1.0668 1.0616 1.0878 1.0870 1.0981 1.1026 1.0998 1.0985 1.0996 1.1001 1.1002 1.1004 1.0981 1.0894 1.0954 1.0922 1.0773
irintensity: 3.4459 1.0967 4.2849 0.8076 1.6043 0.6545 0.3004 0.8890 0.4066 2.1109 1.6258 0.6988 0.6350 0.3187 0.4660 0.5554 0.3161 10.1791 4.9614 0.1637 1.4985 17.6490 1.4985 7.3098 2.1132 1.4704 0.3849 7.6239 127.7037 11.4213 4.0881 1.4534 3.2517 23.9244 8.2092 1.8712 3.1608 4.7064 4.8121 36.0607 13.3347 2.6247 16.2828 5.6627 20.1896 53.5442 12.6166 4.8053 1.3742 8.0440 3.3159 11.3978 17.6859 22.3575 12.5081 214.5360 10.7114 20.3176 9.7304 0.0300 101.2406 17.5236 95.3677 304.8505 7.5288 59.9783 14.3449 173.9836 16.0366 6.2949 6.1267 71.0257 7.4853 21.8893 15.8203 2.7168 43.5474 0.3606 3.1046 8.1238 24.0319 23.5340 31.6119 83.3377 211.8859 11.4897 5.2410 6.7213 12.2893 13.3760 99.8444 13.8363 16.4544 10.4905 151.7286 8.8344 22.8365 249.8568 91.2846 31.4954 110.4819 16.8017 34.0164 28.1306 43.9394 4.2129 37.2660 21.8029 36.9506 14.9118 38.1644 17.5796 106.4355 29.4348 42.3478 3.8238 14.3796 11.4043 5.0074 46.2229
temp: 298.150 k
press: 1.00000 atm
elementType: 8 8 7 7 6 6 6 6 6 6 6 6 6 6 6 6 6 6 6 6 1 1 1 1 1 1 1 1 1 1 1 1 1 1 1 1 1 1 1 1 1 1
symmnumber: 1
zpe: 925783.3 jmol-1
zpe.correction: 0.352612 hartree
zpe.thermalcorrener: 0.372523 hartree
zpe.thermalcorrenthalpy: 0.373467 hartree
zpe.thermalcorrgfe: 0.302349 hartree
zpe.sumelectzpe: -881.351509 hartree
zpe.sumelectthermal: -881.331598 hartree
zpe.sumelectthermalent: -881.330654 hartree
zpe.sumelectthermalfe: -881.401772 hartree
dipole: 1.8946 0.4927 0.1866
dipole: 1.9665
quadrupole: -89.5503 -117.4619 -120.9185
quadrupole: 5.1478 -7.1302 0.4051
quadrupole: 19.7599 -8.1517 -11.6082 5.1478 -7.1302 0.4051
hfenergy: -881.7041213 hartree
pointgroup: C01 [X(C16H22N2O2)]
dipole: 0.7477364 -0.1946383 0.0400022 debye
polarizability: 269.3670872|3.3511908|146.3876708|-4.4776207|-26.181575|166.9239408 unknown
InChI: InChI=1S/C16H22N2O2/c1-4-18-8-7-16(2)13-10-12(20-15(19)17-3)6-5-11(13)9-14(16)18/h5-6,10,14,17H,4,7-9H2,1-3H3
charge 0 multiplicity 1
42 atoms
O  3.458888 -0.280195 0.483331
O  3.385978 1.094143 -1.473131
N  -3.557348 0.525964 0.549378
N  5.381244 0.498444 -0.386677
C  -1.526859 -0.130065 -0.761533
C  -2.738086 -0.661455 0.140836
C  -1.78472 1.409386 -0.849009
C  -2.102429 -1.400221 1.367516
C  -0.286538 -0.455747 0.071763
C  -2.637129 1.698772 0.41568
C  -0.607868 -1.164763 1.252808
C  -1.469695 -0.799419 -2.155415
C  -4.839637 0.679118 -0.193586
C  1.046926 -0.118891 -0.249293
C  0.41994 -1.552212 2.140931
C  2.059916 -0.515947 0.653657
C  -5.819448 1.620139 0.532163
C  1.759743 -1.227801 1.83983
C  4.016253 0.504703 -0.561083
C  6.283304 1.211849 -1.292969
H  -3.380608 -1.354031 -0.432656
H  -2.364319 1.644993 -1.762555
H  -0.845871 1.989629 -0.880131
H  -2.341544 -2.481718 1.354022
H  -2.530603 -0.986869 2.29889
H  -1.985359 1.754402 1.308569
H  -3.207406 2.641072 0.357871
H  -0.633212 -0.397289 -2.756846
H  -1.322909 -1.891836 -2.068402
H  -2.407458 -0.618188 -2.714024
H  -4.693018 1.036636 -1.244868
H  -5.300073 -0.324386 -0.262344
H  1.301555 0.435416 -1.154291
H  0.188642 -2.100445 3.061292
H  -6.009582 1.251317 1.555164
H  -5.417807 2.646715 0.611185
H  -6.780361 1.676531 -0.01309
H  2.580705 -1.512864 2.504703
H  5.748612 -0.026287 0.407132
H  6.986546 0.517186 -1.788527
H  6.862377 1.985842 -0.756065
H  5.669958 1.702871 -2.064825
