program: Gaussian 09
title: 000210968
version: EM64L-G09RevD.01
frameworkgroup: C1[X(C24H23NO2)]
method: RPBEPBE
basis: SDD
operation: Freq
keyword: #p
keyword: freq=noraman
keyword: PBEPBE/SDD
title: #p freq=noraman PBEPBE/SDD
converged: YES YES NO NO
title: Mulliken charges:
elementType: O O N C C C C C C C C C C C C C C C C C C C C C C C C H H H H H H H H H H H H H H H H H H H H H H H
charge: -0.172614 -0.176123 -0.058315 -0.086823 -0.401193 -0.392633 -0.391076 -0.368505 -0.368947 -0.523213 -0.065637 -0.073596 0.410642 0.274040 0.270697 -0.407888 0.013201 -0.379614 -0.379195 -0.392874 -0.392430 -0.056239 -0.209467 -0.212474 -0.240331 -0.241512 -0.238273 0.189793 0.210777 0.205128 0.194126 0.191481 0.204673 0.245167 0.168754 0.167970 0.211375 0.269558 0.269544 0.236770 0.213298 0.277715 0.276025 0.282514 0.282878 0.239478 0.240281 0.226913 0.227106 0.229070
chargesum: 0.00000
title: Mulliken charges with hydrogens summed into heavy atoms:
elementType: O O N C C C C C C C C C C C C C C C C C C C C C C C C
charge: -0.172614 -0.176123 -0.058315 -0.086823 -0.000623 0.006620 0.005078 0.045416 0.010397 0.015889 -0.065637 -0.073596 0.410642 0.274040 0.270697 0.042180 0.013201 -0.101899 -0.103170 -0.110360 -0.109552 -0.056239 0.030011 0.027807 -0.013418 -0.014405 -0.009203
polarizability: 3.30260511e+02 -3.99553287e+01 2.17672932e+02 -1.20589175e+00 -6.83289959e+00 2.38528333e+02
1716.lowfreq: -20.1304 -15.7930 -7.5866 -3.0893 -0.0008 -0.0007 -0.0003 6.9260 15.1412
frequency: -15.4491 -13.2320 13.9182 19.1486 26.7888 52.0503 55.1042 98.1042 107.1495 146.2558 147.6255 170.5443 178.6768 207.2894 220.0362 234.4109 243.6327 247.5497 268.4951 290.0014 296.7247 307.4734 331.1945 359.6507 370.8838 384.8501 402.0729 410.9002 446.0876 446.6105 462.9924 508.4644 517.0874 525.9329 547.7551 572.1930 589.2767 615.1503 657.8020 677.1686 689.2739 704.8043 708.4660 750.4214 758.0587 781.4884 782.6224 798.5029 804.4292 820.1849 849.9114 854.9388 863.8664 873.7358 904.1672 906.2725 911.7479 936.6423 956.4931 958.8081 977.3965 984.9816 989.0388 989.5020 991.4034 1000.9097 1011.6721 1012.4827 1033.3480 1034.6127 1044.0979 1078.6405 1083.1896 1093.5425 1096.1001 1103.3682 1119.1960 1145.0243 1149.1902 1168.6665 1169.1102 1175.2044 1184.2407 1185.0856 1192.7672 1205.0685 1230.1840 1247.4880 1249.6685 1262.9555 1267.9004 1282.5414 1288.1260 1308.3021 1327.1997 1330.6218 1333.6021 1337.7266 1348.2524 1362.8261 1373.6797 1387.7976 1409.3031 1434.5015 1441.7609 1449.3766 1452.1204 1453.3403 1455.4667 1460.4219 1465.5137 1467.1803 1479.4147 1482.1160 1585.5146 1588.4282 1601.9590 1606.5472 1624.4489 1649.6009 2285.0857 2809.9243 2815.6738 2830.4314 2966.4129 2982.8139 2985.0346 2993.4700 2996.7885 3015.6911 3031.6050 3043.3271 3045.3181 3050.5905 3053.6872 3124.4372 3135.2888 3135.9008 3150.0061 3150.0340 3158.3111 3161.8359 3166.5913 3171.3809
redmass: 3.7953 4.7028 3.3792 4.8409 5.7103 4.2106 5.3698 4.5073 4.1843 7.7050 4.7745 4.7178 4.6698 4.0417 2.2157 4.8976 2.7476 3.6149 4.3383 2.1769 5.4965 4.2454 8.6212 4.2550 4.1495 1.8458 2.8972 3.3571 2.9273 4.3621 3.3499 3.3337 5.0772 7.5360 4.7389 3.2462 4.5716 6.3691 4.5698 6.2134 5.7032 2.7667 2.4927 3.7130 1.9633 3.5429 1.6229 2.5099 1.4725 3.8243 2.1928 1.6468 1.2414 6.5348 2.3392 2.6166 1.8497 1.5555 1.4491 2.7411 1.8142 1.5697 3.5974 3.5984 1.3743 1.3211 1.5037 1.8268 2.3359 2.8159 2.2145 1.4327 2.3378 2.4497 1.6365 4.0930 2.5101 2.1811 1.4186 1.3226 2.4537 1.0521 2.2264 2.7886 1.2804 1.1320 1.2184 1.5325 2.7389 1.2388 1.2790 1.6287 1.3468 1.6100 1.2959 1.3778 1.4070 1.4284 1.4987 1.4190 6.2471 1.4665 8.0218 2.2641 1.1032 1.0912 1.0837 2.5460 2.5249 1.0892 1.0820 1.0930 1.0971 2.0856 6.2960 7.3891 7.7060 5.8460 9.6136 12.3462 11.7396 1.0710 1.0715 1.0690 1.0621 1.0612 1.0622 1.0584 1.0842 1.0868 1.0959 1.0957 1.0951 1.1025 1.1036 1.0848 1.0889 1.0864 1.0929 1.0903 1.0949 1.0956 1.1008 1.1003
irintensity: 0.0314 0.4628 0.8657 0.2354 3.9873 0.3020 0.0888 1.0590 0.2910 0.2759 6.0699 1.6786 0.5277 0.6661 4.0842 1.8257 1.5282 3.2323 1.4296 5.5212 0.2937 3.8075 8.9308 0.3344 0.0278 3.3351 0.0130 1.1054 0.1612 0.0250 1.9066 0.8176 16.1630 0.8871 22.5826 12.5787 20.6121 0.0170 0.0188 2.7291 0.0925 36.4916 15.7514 15.4625 36.4731 1.0755 85.9402 5.7073 0.0515 0.0491 2.9834 6.5361 0.0441 17.2375 4.8620 1.2310 1.1279 3.8250 10.2576 10.5700 5.0880 3.2667 8.4496 14.3964 0.0227 0.7178 0.1282 0.1631 19.6768 0.1953 10.1568 7.4297 0.8072 14.5220 12.0913 13.1046 6.1536 2.6710 8.8984 6.7070 26.6090 0.1629 1.5083 2.5382 4.0754 13.7855 2.3151 20.5153 155.9308 3.4230 11.7654 1.9496 6.6641 77.3427 33.0901 4.5604 13.9068 1.1752 1.2124 5.3917 0.1378 7.1896 10.0350 16.2716 14.4764 7.1520 1.8236 1.2617 2.0090 12.9091 3.8467 11.4038 9.1496 51.5699 28.3316 123.0995 1.6137 13.5067 90.5567 75.7427 0.2828 37.7472 39.8666 253.7565 44.3229 29.6190 29.2594 19.2847 12.8807 63.0929 61.2134 33.8554 4.2124 1.1311 104.6658 0.0062 16.1772 2.0656 13.5250 3.4391 7.1168 5.6825 35.1042 22.2235
temp: 298.150 k
press: 1.00000 atm
elementType: 8 8 7 6 6 6 6 6 6 6 6 6 6 6 6 6 6 6 6 6 6 6 6 6 6 6 6 1 1 1 1 1 1 1 1 1 1 1 1 1 1 1 1 1 1 1 1 1 1 1
symmnumber: 1
zpe: 1060461.1 jmol-1
zpe.correction: 0.403908 hartree
zpe.thermalcorrener: 0.426163 hartree
zpe.thermalcorrenthalpy: 0.427107 hartree
zpe.thermalcorrgfe: 0.350887 hartree
zpe.sumelectzpe: -1131.568175 hartree
zpe.sumelectthermal: -1131.545921 hartree
zpe.sumelectthermalent: -1131.544977 hartree
zpe.sumelectthermalfe: -1131.621197 hartree
dipole: -2.0335 2.3623 0.4187
dipole: 3.1450
quadrupole: -139.8341 -146.1172 -161.4505
quadrupole: -3.7172 2.8489 0.1608
quadrupole: 9.2998 3.0167 -12.3166 -3.7172 2.8489 0.1608
hfenergy: -1131.9720838 hartree
pointgroup: C01 [X(C24H23N1O2)]
dipole: 0.8141288 0.9245909 0.1153381 debye
polarizability: 331.6661033|36.9193399|214.7765924|9.0852042|-1.8321194|240.0190811 unknown
InChI: InChI=1S/C24H23NO2/c26-22-20-13-5-6-14-21(20)23(27)24(22,19-11-3-1-4-12-19)15-7-10-18-25-16-8-2-9-17-25/h1,3-6,11-14H,2,8-9,15-18H2
charge 0 multiplicity 1
50 atoms
O  -1.574276 -0.522607 2.57185
O  -0.735926 0.33541 -2.122095
N  3.617134 -1.27439 0.010696
C  -1.675506 -0.460511 0.06544
C  5.66321 0.410554 -1.261683
C  4.168674 0.499633 -1.647095
C  5.807862 -0.103006 0.189421
C  3.459526 -0.84678 -1.404129
C  5.047077 -1.431178 0.379376
C  -1.270063 -1.967719 -0.138658
C  -1.258681 0.02778 1.485255
C  -0.839922 0.459184 -0.873612
C  -3.199415 -0.319833 -0.17831
C  -0.39624 1.232627 1.333903
C  -0.152722 1.483462 -0.039291
C  2.848469 -2.511472 0.320608
C  0.17408 -2.20246 0.027112
C  0.169472 2.047831 2.335894
C  0.665801 2.554956 -0.452099
C  -3.701389 -0.076618 -1.484061
C  -4.120647 -0.523974 0.882649
C  1.392742 -2.338786 0.161091
C  0.983276 3.128291 1.927481
C  1.229217 3.37925 0.547606
C  -5.093546 -0.020268 -1.717121
C  -5.51178 -0.466697 0.644198
C  -6.005901 -0.212098 -0.655098
H  6.178192 -0.289954 -1.951855
H  6.155862 1.395073 -1.374863
H  3.671161 1.275267 -1.032415
H  4.054419 0.78649 -2.710213
H  6.874205 -0.249734 0.448826
H  5.389961 0.645661 0.889861
H  2.380487 -0.759334 -1.62269
H  3.881462 -1.618883 -2.103091
H  5.542115 -2.229008 -0.238809
H  5.102774 -1.751961 1.437305
H  -1.597009 -2.264009 -1.15309
H  -1.848116 -2.565735 0.591062
H  3.067384 -2.788476 1.370829
H  3.179008 -3.376199 -0.314999
H  -0.019291 1.837256 3.393167
H  0.852635 2.73054 -1.516314
H  -3.005696 0.064121 -2.317081
H  -3.750999 -0.730558 1.891808
H  1.437921 3.782559 2.679381
H  1.868119 4.222371 0.262766
H  -5.463062 0.171022 -2.730968
H  -6.20811 -0.624185 1.475664
H  -7.085451 -0.167708 -0.837913
