program: Gaussian 09
title: 000216370
version: EM64L-G09RevD.01
frameworkgroup: C1[X(C25H22N2O)]
method: RPBEPBE
basis: SDD
operation: Freq
keyword: #p
keyword: freq=noraman
keyword: PBEPBE/SDD
title: #p freq=noraman PBEPBE/SDD
converged: NO YES NO NO
title: Mulliken charges:
elementType: O N N C C C C C C C C C C C C C C C C C C C C C C C C C H H H H H H H H H H H H H H H H H H H H H H
charge: -0.453456 -0.158578 -0.112386 -0.089506 -0.034351 0.049573 0.296098 0.235688 -0.063129 0.422640 -0.399255 -0.399640 -0.353035 0.335314 -0.380865 -0.396497 -0.237984 -0.246392 -0.664026 -0.370660 -0.406267 0.441193 -0.399073 -0.393630 -0.255991 -0.244400 -0.812390 -0.250593 0.263278 0.242254 0.213101 0.249447 0.349466 0.239749 0.274270 0.229632 0.228622 0.241929 0.220890 0.230076 0.226481 0.226602 0.286414 0.264563 0.225412 0.221994 0.223643 0.232613 0.226768 0.224391
chargesum: 0.00000
title: Mulliken charges with hydrogens summed into heavy atoms:
elementType: O N N C C C C C C C C C C C C C C C C C C C C C C C C C
charge: -0.103990 -0.158578 -0.112386 -0.089506 -0.034351 0.049573 0.296098 0.235688 -0.063129 0.422640 -0.135977 -0.157386 0.109513 0.335314 -0.141116 -0.122227 -0.008352 -0.017769 0.028870 -0.144179 -0.179665 0.441193 -0.112659 -0.129067 -0.030579 -0.022406 -0.129366 -0.026202
polarizability: 3.74496842e+02 -4.64902499e+00 3.09781287e+02 -1.25496756e+00 -3.26658264e+01 2.02272222e+02
1716.lowfreq: -17.0428 -3.8103 -0.0050 0.0002 0.0004 3.7669 11.4562 25.7860 30.3502
frequency: -12.4199 25.7792 30.3426 35.3827 44.4811 46.7715 54.5105 80.4415 92.5664 114.8672 131.7862 155.4648 168.4333 198.0937 206.4105 214.9823 245.5987 261.9071 284.3666 294.3815 308.1632 329.7640 333.5241 362.3980 382.7126 390.9722 405.8838 406.2547 436.0651 452.1206 474.1528 481.1220 509.7196 536.8803 575.0146 577.2908 597.7427 616.0166 636.8639 652.5931 657.8644 667.3617 679.2339 702.8399 723.9516 725.7686 747.4430 761.2911 770.3987 786.6983 788.8982 792.5742 816.5993 855.8061 859.6306 872.7426 878.4663 895.4691 937.3235 947.6657 955.5242 960.6675 969.7432 983.1110 985.2885 986.1484 986.7947 990.0129 993.1209 999.4241 1014.6453 1018.9045 1024.8412 1044.5939 1047.5806 1070.2286 1084.9417 1087.4816 1100.4465 1126.0427 1150.3562 1157.8142 1171.4448 1174.8182 1190.8504 1194.5642 1195.7111 1209.7371 1222.3837 1253.4581 1280.3392 1292.5863 1304.2799 1307.7067 1320.7705 1341.8263 1347.8886 1370.1191 1378.9964 1386.2975 1390.3222 1396.1267 1404.1689 1430.3468 1436.3072 1442.9261 1462.5500 1464.1097 1467.8093 1471.1764 1473.8076 1483.9219 1496.6738 1505.3721 1528.8721 1534.2229 1583.2696 1586.6243 1597.9592 1618.1531 1621.4553 1624.5761 2972.9293 2990.0535 3016.5758 3053.1521 3079.4142 3083.0993 3093.4734 3107.2769 3115.9630 3121.1163 3121.2480 3126.8228 3132.7106 3137.3074 3143.4805 3147.0149 3149.1956 3156.6626 3165.0853 3165.4564 3166.4272 3557.2177
redmass: 2.4443 4.6316 3.8754 3.6978 2.8995 1.1945 4.1938 4.7812 4.1159 5.2824 4.1372 2.2511 3.4634 3.5027 3.5810 2.9043 2.1201 5.3652 4.5064 4.1172 3.8046 3.1734 1.6805 2.6302 3.5254 4.6494 2.8689 2.8754 4.0885 4.1375 4.3566 5.0456 3.2505 4.4097 4.1841 5.0161 5.1972 6.4372 6.9562 6.5904 5.7139 6.0447 5.5506 1.7917 4.3895 3.3123 3.2806 1.9313 2.3693 2.6429 1.7045 2.2446 1.7156 1.2722 1.2663 2.2321 1.9667 3.6753 1.4677 1.4798 2.5469 2.3091 2.1267 1.4025 1.6912 1.9321 1.6412 1.7340 4.0770 1.3366 2.9595 2.4026 2.5661 2.6796 1.5619 3.2682 1.7128 2.0566 2.0547 1.3195 2.1093 1.8734 1.0567 1.1763 1.7274 1.2535 1.3471 3.2057 2.9612 3.0063 2.0119 1.9310 1.5313 1.4299 1.7724 1.5732 1.5546 5.2943 6.7560 4.0458 1.3502 1.2361 3.2210 2.4120 2.6834 2.4573 1.1201 2.7463 1.0419 1.0584 1.0933 1.0598 5.6487 2.7129 5.7315 7.3166 6.3724 6.0966 6.8003 6.3492 7.0426 6.4467 1.0383 1.0355 1.0637 1.0956 1.1001 1.0994 1.0985 1.1026 1.0879 1.0893 1.0848 1.0858 1.0887 1.0896 1.0957 1.0932 1.0944 1.0959 1.1001 1.1005 1.0943 1.0659
irintensity: 0.0376 0.0959 0.0811 0.1517 0.2882 0.1859 1.4587 0.4618 0.7487 0.4085 0.8734 0.9096 0.0535 0.0062 1.2879 0.5837 0.4912 0.7178 1.2484 3.4841 1.8087 13.6945 61.6787 37.4612 10.2403 7.3963 1.3840 0.8617 1.8094 11.7731 3.8660 3.2494 9.9132 3.2308 5.5161 5.2024 10.0612 1.6487 0.3804 5.8733 3.7877 3.0820 2.9272 47.3111 28.5080 7.0556 39.5578 36.2337 5.7298 27.0044 15.2628 3.7617 75.5619 2.5691 0.8488 12.2181 6.4772 39.9538 5.8443 3.5505 18.5252 23.1565 13.2539 0.4722 1.3688 0.5938 2.1000 4.4349 10.7573 2.2974 6.8004 4.6894 24.5184 4.5344 15.1849 22.1710 5.1674 16.6108 6.9102 3.9203 18.6660 28.6395 0.4426 0.1734 4.7872 14.8382 1.0347 1.0809 0.3376 11.4361 1.6484 33.1478 5.9165 2.1214 17.1530 6.7016 10.7264 10.8229 1.2423 14.1686 15.0035 9.6669 5.0981 14.0438 6.5431 2.0873 10.3016 66.5562 12.6025 15.7401 14.8547 7.1404 37.8626 30.7482 7.2604 26.5268 0.0641 0.3169 2.5741 14.6510 4.4717 3.0482 42.6790 21.6522 31.7575 21.0508 9.2516 17.9908 40.6705 22.7512 14.0895 26.9058 0.7654 2.8705 16.7699 7.9580 11.3102 20.0206 20.6910 14.8624 47.2395 14.1635 3.9924 9.6097
temp: 298.150 k
press: 1.00000 atm
elementType: 8 7 7 6 6 6 6 6 6 6 6 6 6 6 6 6 6 6 6 6 6 6 6 6 6 6 6 6 1 1 1 1 1 1 1 1 1 1 1 1 1 1 1 1 1 1 1 1 1 1
symmnumber: 1
zpe: 1049865.3 jmol-1
zpe.correction: 0.399873 hartree
zpe.thermalcorrener: 0.423376 hartree
zpe.thermalcorrenthalpy: 0.424321 hartree
zpe.thermalcorrgfe: 0.345639 hartree
zpe.sumelectzpe: -1148.643147 hartree
zpe.sumelectthermal: -1148.619643 hartree
zpe.sumelectthermalent: -1148.618699 hartree
zpe.sumelectthermalfe: -1148.697381 hartree
dipole: -3.4637 0.0533 1.1199
dipole: 3.6407
quadrupole: -145.0935 -150.4816 -158.5197
quadrupole: 10.2636 -0.1029 -4.9070
quadrupole: 6.2714 0.8834 -7.1547 10.2636 -0.1029 -4.9070
hfenergy: -1149.0430196 hartree
pointgroup: C01 [X(C25H22N2O1)]
dipole: 1.3446478 0.1570636 -0.4678557 debye
polarizability: 372.579984|11.7849975|312.4126903|-7.994036|30.4816269|201.5576765 unknown
InChI: InChI=1S/C25H22N2O/c1-3-27-24-20-11-7-8-12-21(20)25(28,19-15-13-17(2)14-16-19)22(24)23(26-27)18-9-5-4-6-10-18/h4-16,28H,3H2,1-2H3
charge 0 multiplicity 1
50 atoms
O  -0.049898 0.79646 2.315667
N  1.578939 -2.449086 -0.469027
N  0.262232 -2.919339 -0.403983
C  0.397949 0.674748 0.904524
C  0.373385 -0.76055 0.389808
C  1.663115 -1.158442 -0.004018
C  1.921241 0.999556 0.776532
C  2.65147 -0.101454 0.221424
C  -0.483111 -1.875625 0.12911
C  -0.448819 1.676649 0.106036
C  2.58074 2.182261 1.132109
C  4.042759 -0.011699 0.014117
C  2.619871 -3.305497 -1.05664
C  -1.930297 -2.045168 0.354875
C  -0.628413 1.52138 -1.289748
C  -1.008211 2.809616 0.743209
C  3.985434 2.271632 0.935207
C  4.704909 1.187821 0.378838
C  2.893356 -2.972682 -2.537672
C  -1.353887 2.477612 -2.029141
C  -1.738767 3.760947 -0.003076
C  -1.92015 3.618017 -1.40148
C  -2.669645 -1.071994 1.0812
C  -2.606414 -3.192754 -0.144638
C  -4.054897 -1.241364 1.291336
C  -3.989365 -3.35815 0.069907
C  -2.683382 4.653685 -2.209449
C  -4.722297 -2.381674 0.787334
H  2.020547 3.025405 1.549641
H  4.611272 -0.842673 -0.417789
H  3.540082 -3.197645 -0.453988
H  2.261181 -4.342124 -0.951079
H  0.461532 0.137075 2.851131
H  -0.212815 0.642691 -1.795698
H  -0.891877 2.921084 1.825017
H  4.515229 3.190115 1.210564
H  5.786291 1.276056 0.226273
H  1.975014 -3.100346 -3.135873
H  3.668732 -3.649419 -2.940001
H  3.246202 -1.932862 -2.65839
H  -1.491377 2.334218 -3.108287
H  -2.177527 4.625715 0.510131
H  -2.158698 -0.195002 1.492145
H  -2.032112 -3.942144 -0.698556
H  -4.612506 -0.482451 1.851841
H  -4.498388 -4.246286 -0.322029
H  -3.314803 5.28722 -1.562455
H  -1.990767 5.324078 -2.755108
H  -3.33613 4.176978 -2.963023
H  -5.798227 -2.509785 0.952375
