program: Gaussian 09
title: 000210966
version: EM64L-G09RevD.01
frameworkgroup: C1[X(C23H23NO2)]
method: RPBEPBE
basis: SDD
operation: Freq
keyword: #p
keyword: freq=noraman
keyword: PBEPBE/SDD
title: #p freq=noraman PBEPBE/SDD
converged: YES YES NO NO
title: Mulliken charges:
elementType: O O N C C C C C C C C C C C C C C C C C C C C C C C H H H H H H H H H H H H H H H H H H H H H H H
charge: -0.173525 -0.175068 -0.098901 -0.085973 -0.059464 -0.077949 -0.523279 0.412406 0.269678 0.271109 -0.380176 -0.380638 -0.395392 -0.389470 0.006494 -0.210088 -0.210425 -0.238021 -0.243801 -0.404652 -0.238180 -0.047931 -0.311960 -0.304106 -0.694676 -0.691160 0.269092 0.269226 0.277780 0.277753 0.281203 0.282837 0.239748 0.240561 0.226953 0.227278 0.234090 0.211412 0.229169 0.176981 0.240265 0.174258 0.209911 0.213064 0.203196 0.236830 0.211334 0.210863 0.231346
chargesum: 0.00000
title: Mulliken charges with hydrogens summed into heavy atoms:
elementType: O O N C C C C C C C C C C C C C C C C C C C C C C C
charge: -0.173525 -0.175068 -0.098901 -0.085973 -0.059464 -0.077949 0.015039 0.412406 0.269678 0.271109 -0.102396 -0.102885 -0.114189 -0.106633 0.006494 0.029660 0.030136 -0.011069 -0.016523 0.040850 -0.009011 -0.047931 0.105286 0.080064 -0.041587 -0.037617
polarizability: 3.12475629e+02 -4.15369045e+01 2.16470086e+02 -3.52551810e+00 -5.12033708e+00 2.37425278e+02
1716.lowfreq: -8.8205 -4.0098 -0.0004 0.0002 0.0005 2.5950 7.9555 10.5658 11.4908
frequency: 1.9113 9.9893 10.5966 25.2001 28.2396 47.9162 55.0470 63.7832 87.8439 108.6399 124.9404 146.2894 165.0896 181.4584 187.4603 207.7429 214.7353 221.7564 235.2182 246.2574 263.6487 278.7818 295.7384 297.3179 325.7618 344.4545 357.5268 393.2259 402.6978 412.1837 447.3038 449.7887 478.5610 516.5016 525.1207 526.2423 557.9795 586.4157 615.6588 657.6843 677.5541 688.7411 705.5399 708.1616 733.5373 759.8266 781.2312 783.2123 792.7519 802.7948 809.1899 819.4411 864.3013 874.6384 905.4674 910.9299 911.6418 936.8339 957.7556 976.0937 985.6700 989.1229 990.4492 991.9644 1001.0401 1011.9377 1013.0340 1033.7517 1034.0100 1058.4288 1074.8860 1083.2453 1087.2968 1096.0556 1105.2395 1115.4988 1158.9076 1168.0349 1168.9139 1175.1692 1183.3902 1184.5306 1194.5744 1204.2839 1228.9237 1242.3222 1249.2125 1279.5211 1282.7675 1286.1894 1306.9040 1329.0185 1355.0290 1363.9174 1374.3139 1376.1992 1385.5771 1387.0189 1409.4071 1434.5132 1439.4676 1453.5943 1456.1145 1457.4207 1466.1028 1468.7408 1472.4605 1476.7728 1482.6971 1486.5086 1492.4542 1585.8575 1588.7472 1601.7290 1607.1150 1624.4990 1649.4582 2284.0945 2816.3794 2832.1671 2851.3969 2982.3810 2984.3506 2992.8240 3026.0730 3035.0857 3041.0239 3049.8046 3074.6090 3077.3738 3087.8957 3092.3624 3124.6978 3135.6095 3136.4657 3149.8537 3150.2774 3158.6409 3161.9830 3167.1627 3171.6573
redmass: 3.0617 4.4423 4.0408 5.0904 5.3972 2.8596 3.6722 3.0403 2.0318 4.1638 3.3975 7.7659 5.5498 4.1862 1.9074 2.5610 1.7913 1.8866 4.5297 6.6943 2.3503 2.0306 3.5385 5.3612 6.2146 4.1814 3.9241 3.7263 2.8968 3.2451 4.3598 3.0597 3.3228 4.3428 6.4650 7.2127 7.6838 5.9310 6.3637 4.5619 6.2020 5.6592 2.8382 2.4240 3.0987 1.8651 3.5051 1.5556 1.2946 1.2035 2.0644 3.8231 1.2415 6.6205 2.8033 1.7765 1.9466 1.5534 3.5276 2.2348 1.5913 4.4975 1.8116 1.4777 1.3197 1.3722 2.0677 2.3492 2.7873 2.7419 1.8854 2.3467 2.1073 1.6321 4.2873 1.8796 2.4122 2.3434 1.2491 1.0517 2.7202 2.1174 2.4036 1.1317 1.2259 1.2712 3.3452 1.1520 1.6295 1.1874 1.6151 1.3834 1.4078 1.3091 6.1421 1.3766 1.2268 1.2373 7.8962 2.2628 1.1026 2.5520 2.4895 1.0909 1.0555 1.0503 1.0560 1.0642 2.0972 1.0572 1.0710 6.3199 7.3829 7.7238 5.8349 9.5487 12.3627 11.7394 1.0715 1.0721 1.0708 1.0354 1.0359 1.0579 1.0835 1.0879 1.0872 1.1024 1.0985 1.0973 1.1001 1.1003 1.0848 1.0889 1.0864 1.0931 1.0902 1.0952 1.0956 1.1004 1.1003
irintensity: 0.2374 0.1319 0.2386 1.6742 2.9849 0.5264 0.3087 0.0989 1.7489 0.2677 2.8741 0.1158 4.4882 1.0848 0.4758 1.2694 0.0436 4.8681 2.9751 0.5442 1.9457 3.6333 1.9972 0.2726 9.9046 2.6392 1.2874 2.4634 0.0185 1.9260 0.0356 5.0103 1.2447 17.6787 1.3397 0.7116 26.0539 25.6701 0.0179 0.0198 2.8175 0.1216 35.7160 17.3126 13.8809 39.6276 0.2363 84.5167 9.1549 4.8895 3.2680 0.0377 0.0534 18.5818 3.1184 1.9061 1.8335 3.8573 14.5859 12.1614 1.3634 0.2809 3.0044 0.1177 0.5796 0.0478 0.4133 19.0905 2.0679 17.7991 20.1184 0.8529 2.2024 11.2238 6.4814 22.6013 14.4229 16.0284 12.6388 0.1583 3.5798 2.1611 28.8176 12.4111 1.3392 14.1563 170.0412 18.2945 1.4817 14.6373 76.6580 4.6279 19.9280 9.0334 0.1205 3.3328 19.0394 23.5849 9.8026 15.9133 15.5976 1.1717 1.7001 4.2634 4.8213 11.1489 6.2655 6.0871 51.0838 10.0441 11.6336 31.8175 122.4707 1.2345 13.5630 87.8926 76.9299 0.1689 56.6977 80.9995 209.5503 28.1876 27.2640 19.6240 13.3936 2.7765 8.0471 1.1219 20.0744 90.0645 51.6301 34.8646 0.0151 15.7640 1.9198 12.1784 4.5316 9.9977 5.7004 32.2299 22.6870
temp: 298.150 k
press: 1.00000 atm
elementType: 8 8 7 6 6 6 6 6 6 6 6 6 6 6 6 6 6 6 6 6 6 6 6 6 6 6 1 1 1 1 1 1 1 1 1 1 1 1 1 1 1 1 1 1 1 1 1 1 1
symmnumber: 1
zpe: 1036543.4 jmol-1
zpe.correction: 0.394799 hartree
zpe.thermalcorrener: 0.420121 hartree
zpe.thermalcorrenthalpy: 0.421065 hartree
zpe.thermalcorrgfe: 0.332600 hartree
zpe.sumelectzpe: -1093.513021 hartree
zpe.sumelectthermal: -1093.487699 hartree
zpe.sumelectthermalent: -1093.486754 hartree
zpe.sumelectthermalfe: -1093.575220 hartree
dipole: -1.7025 2.3624 0.5700
dipole: 2.9672
quadrupole: -134.3328 -140.0710 -156.5079
quadrupole: -4.0834 1.1150 1.0810
quadrupole: 9.3044 3.5662 -12.8707 -4.0834 1.1150 1.0810
hfenergy: -1093.9078192 hartree
pointgroup: C01 [X(C23H23N1O2)]
dipole: -0.698826 -0.9251972 0.1359664 debye
polarizability: 315.1035584|36.8551588|213.8039016|-10.9951079|4.9659871|237.4635332 unknown
InChI: InChI=1S/C23H23NO2/c1-3-24(4-2)17-11-10-16-23(18-12-6-5-7-13-18)21(25)19-14-8-9-15-20(19)22(23)26/h5-9,12-15H,3-4,16-17H2,1-2H3
charge 0 multiplicity 1
49 atoms
O  1.164917 0.650711 2.545081
O  0.573546 -0.505232 -2.12017
N  -3.967092 1.032483 -0.463051
C  1.380586 0.457029 0.052525
C  0.936364 0.019765 1.480629
C  0.640395 -0.560983 -0.864332
C  0.90243 1.924481 -0.252035
C  2.919963 0.392117 -0.1172
C  0.169364 -1.251554 1.364881
C  -0.005953 -1.587792 -0.000519
C  -0.370986 -2.055156 2.38989
C  -0.730253 -2.736127 -0.382048
C  3.500403 0.052947 -1.367491
C  3.7724 0.762943 0.956261
C  -0.558733 2.08486 -0.16941
C  -1.089195 -3.212227 2.013172
C  -1.267522 -3.548892 0.641156
C  4.903591 0.066485 -1.532137
C  5.174433 0.774964 0.786391
C  -3.257022 2.274705 -0.036362
C  5.747783 0.424354 -0.456951
C  -1.788639 2.160027 -0.108944
C  -3.678432 0.690198 -1.885454
C  -5.424549 1.130002 -0.178429
C  -3.992965 -0.778233 -2.225822
C  -5.76418 1.049875 1.322683
H  1.264077 2.186727 -1.264075
H  1.408521 2.591972 0.470943
H  -0.235018 -1.778635 3.440052
H  -0.865269 -2.978908 -1.440842
H  2.858208 -0.213521 -2.212436
H  3.339423 1.041377 1.922313
H  -1.52143 -3.860329 2.783383
H  -1.833843 -4.449759 0.380698
H  5.334927 -0.200432 -2.503589
H  5.81711 1.060767 1.626799
H  -3.542301 2.490684 1.00956
H  -3.577516 3.162393 -0.645053
H  6.835805 0.433542 -0.586982
H  -4.226164 1.371809 -2.587034
H  -2.599467 0.862707 -2.048675
H  -5.863827 2.065276 -0.616713
H  -5.915534 0.283249 -0.689362
H  -3.673669 -1.002278 -3.26046
H  -5.070855 -1.011945 -2.152117
H  -3.447933 -1.445554 -1.535234
H  -6.860324 1.00966 1.463025
H  -5.393075 1.922519 1.889941
H  -5.318097 0.14063 1.761948
