program: Gaussian 09
title: 000216328
version: EM64L-G09RevD.01
frameworkgroup: C1[X(C15H14O6)]
method: RPBEPBE
basis: SDD
operation: Freq
keyword: #pfreq=noraman
keyword: PBEPBE/SDD
title: #p freq=noraman PBEPBE/SDD
converged: YES YES NO NO
title: Mulliken charges:
elementType: O O O O O O C C C C C C C C C C C C C C C H H H H H H H H H H H H H H
charge: -0.275357 -0.416417 -0.400550 -0.326157 -0.279105 -0.423420 0.219297 -0.507819 -0.059508 0.257550 0.203374 0.056828 0.089365 0.616305 -0.709191 -0.722677 0.255393 -0.687153 -0.530112 0.349626 -0.513158 0.266127 0.255266 0.258918 0.232078 0.238300 0.231507 0.242607 0.358450 0.280889 0.378938 0.358836 0.259242 0.233252 0.208475
chargesum: 0.00000
title: Mulliken charges with hydrogens summed into heavy atoms:
elementType: O O O O O O C C C C C C C C C C C C C C C
charge: -0.275357 -0.057968 -0.021612 -0.326157 -0.279105 -0.064584 0.219297 0.013575 -0.059508 0.257550 0.203374 0.056828 0.089365 0.616305 -0.450273 -0.020791 0.255393 -0.444547 -0.249224 0.349626 0.187811
polarizability: 3.14764002e+02 -2.38572070e+01 2.13725891e+02 7.46536324e+00 -1.86594133e+00 9.76262292e+01
1716.lowfreq: -6.6979 -3.3623 0.0007 0.0008 0.0008 3.8914 37.2463 52.2608 84.0038
frequency: 37.2387 52.2466 84.0027 109.9274 115.5247 131.1155 147.5212 161.5018 187.8270 220.2841 235.2466 242.8837 262.8987 279.9625 286.8574 308.2831 321.1525 343.8129 361.5014 368.7002 400.7800 404.0449 420.5460 436.5827 472.0452 490.5858 506.2964 519.8998 561.7874 575.9760 587.1847 616.6560 617.6624 622.1888 632.0605 645.1533 706.5870 723.3096 795.0788 798.4784 814.2151 822.8080 850.4989 870.2864 891.7089 897.3625 935.4413 946.3378 994.3435 1033.9742 1043.1737 1062.0550 1077.5007 1096.0948 1104.1475 1106.8844 1128.0585 1145.3961 1154.2334 1177.6477 1183.5041 1224.4324 1245.0632 1260.9321 1292.9909 1322.7332 1347.2731 1368.5918 1385.9639 1396.4175 1402.4639 1412.4724 1421.0941 1423.2860 1444.4964 1449.8701 1452.2264 1459.3180 1473.5503 1480.0308 1512.3010 1569.0877 1604.8565 1613.5508 1653.8232 2405.2619 2970.1406 2999.1996 3011.3576 3082.0497 3094.4237 3096.5922 3114.0224 3121.1417 3127.0949 3160.8272 3189.9221 3555.2267 3576.6416
redmass: 4.8906 5.8357 3.8538 5.0953 1.8178 1.7898 5.3122 4.1032 4.7934 1.0576 3.8618 6.4616 3.8501 5.1371 4.2865 3.7354 3.3921 6.7803 2.4989 2.3125 1.1585 4.5264 2.4131 6.3523 5.7868 5.5054 4.7989 6.6239 6.2928 5.5322 4.4838 4.6447 4.3364 5.2969 4.9618 3.3075 4.9748 4.6755 5.0185 3.8846 1.6167 4.3485 5.8606 1.6491 1.9846 6.5960 1.8756 1.9174 3.9543 1.1070 3.4787 4.5966 3.3012 2.0882 1.2491 1.8700 1.6717 2.6183 1.3830 1.6117 1.5685 1.4206 1.9770 2.4495 1.7141 4.3631 5.4445 2.2358 4.3180 1.4045 2.5451 1.9430 5.2693 1.3056 1.9341 2.9204 1.1474 1.0682 1.0712 1.0563 4.3650 6.5230 3.4022 4.6795 4.0100 1.0869 1.0350 1.0370 1.0640 1.0977 1.0967 1.0986 1.1006 1.0917 1.1033 1.0920 1.0927 1.0654 1.0659
irintensity: 1.0375 0.6451 0.1893 1.3711 2.8684 4.8362 1.0376 0.2217 3.1868 0.0074 1.4372 0.1369 3.2649 5.4923 5.7896 12.5444 1.6288 5.4948 54.2554 72.8003 142.3905 9.4578 14.4543 23.3688 39.1129 10.9497 51.9468 12.1622 4.8080 49.1363 6.1955 0.7026 5.9373 8.5208 2.6495 10.3126 4.6551 7.1301 45.4942 75.3863 13.0788 66.2263 3.3382 9.1104 65.5236 38.5637 10.3736 7.7940 45.0603 93.0265 156.7000 132.3998 38.3101 126.4546 11.4768 54.4498 173.4008 73.8130 8.8477 95.6990 93.0713 81.4085 35.6027 54.2225 58.3878 44.8010 168.9152 15.3074 40.1598 56.6994 371.4034 38.3084 57.9556 18.9471 9.3964 46.2574 18.4541 11.0327 10.6756 19.1016 111.5469 300.3036 109.5150 177.9868 682.0522 377.3881 90.6893 12.4077 3.7065 20.1970 2.7508 16.4793 16.5954 13.6459 20.7974 4.4099 0.0505 11.6871 67.7979
temp: 298.150 k
press: 1.00000 atm
elementType: 8 8 8 8 8 8 6 6 6 6 6 6 6 6 6 6 6 6 6 6 6 1 1 1 1 1 1 1 1 1 1 1 1 1 1
symmnumber: 1
zpe: 686942.3 jmol-1
zpe.correction: 0.261643 hartree
zpe.thermalcorrener: 0.280323 hartree
zpe.thermalcorrenthalpy: 0.281267 hartree
zpe.thermalcorrgfe: 0.215945 hartree
zpe.sumelectzpe: -1029.823447 hartree
zpe.sumelectthermal: -1029.804767 hartree
zpe.sumelectthermalent: -1029.803823 hartree
zpe.sumelectthermalfe: -1029.869145 hartree
dipole: -2.7536 -4.8688 1.6695
dipole: 5.8373
quadrupole: -110.4587 -112.7860 -121.6633
quadrupole: 3.0597 5.9230 1.5789
quadrupole: 4.5106 2.1833 -6.6940 3.0597 5.9230 1.5789
hfenergy: -1030.0850894 hartree
pointgroup: C01 [X(C15H14O6)]
dipole: 1.0459369 1.9540251 0.6017412 debye
polarizability: 315.6405819|-22.3241936|212.9287323|-5.1869565|-2.1474733|97.5468075 unknown
InChI: InChI=1S/C15H14O6/c1-15(19)6-9(17)13-11(21-15)4-7-3-8(16)5-10(20-2)12(7)14(13)18/h3-5,16,18-19H,6H2,1-2H3
charge 0 multiplicity 1
35 atoms
O  2.563013 1.558983 -0.143534
O  3.632394 0.426392 1.689624
O  -0.277851 -2.408164 -0.158391
O  2.197252 -2.618249 -0.34886
O  -3.063993 -2.064382 -0.081752
O  -4.715678 2.387173 -0.110936
C  3.724324 0.702526 0.267218
C  3.663723 -0.670548 -0.418518
C  1.143247 -0.470742 -0.15498
C  1.288584 0.960238 -0.099694
C  2.300865 -1.323702 -0.286455
C  -1.347255 -0.218039 -0.040216
C  -0.172748 -1.04782 -0.110705
C  -1.145213 1.225985 -0.047619
C  0.180514 1.785613 -0.051026
C  4.949789 1.54099 -0.089889
C  -2.713925 -0.706886 -0.034368
C  -2.268258 2.104548 -0.060011
C  -3.793296 0.182501 -0.06846
C  -3.568928 1.584261 -0.084447
C  -2.850307 -2.863044 1.142104
H  4.425229 -1.337651 0.017144
H  3.890207 -0.551888 -1.495378
H  0.314101 2.870786 -0.025164
H  5.86823 1.008428 0.209166
H  4.984459 1.743645 -1.172866
H  4.913484 2.512281 0.435718
H  -2.094907 3.187886 -0.066882
H  3.677222 1.281602 2.189923
H  -4.812743 -0.209102 -0.081222
H  0.706264 -2.793552 -0.250213
H  -4.477761 3.347937 -0.115157
H  -1.77788 -2.93559 1.385682
H  -3.244145 -3.861702 0.900958
H  -3.421912 -2.423316 1.983105
