program: Gaussian 09
title: 000210955
version: EM64L-G09RevD.01
frameworkgroup: C1[X(C17H16N4O3)]
method: RPBEPBE
basis: SDD
operation: Freq
keyword: #p
keyword: freq=noraman
keyword: PBEPBE/SDD
title: #p freq=noraman PBEPBE/SDD
converged: YES YES NO NO
title: Mulliken charges:
elementType: O O O N N N N C C C C C C C C C C C C C C C C C H H H H H H H H H H H H H H H H
charge: -0.296399 -0.205862 -0.211005 -0.171687 -0.295727 -0.107781 0.016126 -0.337708 -0.364980 -0.415336 -0.407566 0.129629 0.224494 0.148863 -0.500495 0.136131 0.197868 -0.317817 0.392178 -0.366357 -0.351353 -0.349225 -0.223634 -0.230568 0.227162 0.252734 0.237160 0.246767 0.193762 0.220044 0.220888 0.196225 0.275202 0.316441 0.266713 0.292567 0.250524 0.249660 0.229743 0.232621
chargesum: 0.00000
title: Mulliken charges with hydrogens summed into heavy atoms:
elementType: O O O N N N N C C C C C C C C C C C C C C C C C
charge: -0.296399 -0.205862 -0.211005 -0.171687 -0.020526 -0.107781 0.016126 0.142188 0.118947 -0.001530 0.009547 0.129629 0.224494 0.148863 -0.184054 0.136131 0.197868 -0.051104 0.392178 -0.073790 -0.100829 -0.099566 0.006109 0.002053
polarizability: 3.46515519e+02 1.54898351e-01 2.56399255e+02 2.26296797e+00 -2.06228111e+01 1.41553683e+02
1716.lowfreq: -6.6027 0.0007 0.0009 0.0010 6.8414 8.2048 32.9657 47.1142 49.3869
frequency: 32.9510 47.0149 49.3494 56.7213 77.9993 87.7568 101.5716 130.6780 177.9834 194.0749 229.4826 251.8503 255.2764 287.6470 301.1364 315.1582 331.3073 354.9663 376.4525 396.4866 420.4763 448.6398 455.2491 470.4013 485.9070 494.7588 518.2228 542.2497 556.6731 569.6856 599.4184 620.5875 636.1724 651.5713 673.2526 701.8209 711.2023 714.1203 728.8235 750.8071 764.1381 798.1886 825.7952 831.3655 844.1986 849.1482 860.1271 879.2884 912.6860 937.6736 944.3455 963.0549 976.4141 984.4230 1019.4938 1028.0576 1048.1146 1057.1803 1069.6208 1081.9062 1094.9412 1110.0392 1131.2392 1145.1231 1149.7727 1163.3043 1168.5967 1191.9234 1195.8420 1210.6955 1222.5093 1244.0872 1246.5133 1258.2560 1274.5935 1283.5590 1319.9122 1332.0963 1354.6325 1361.6281 1362.9505 1388.3577 1391.3240 1403.0140 1416.2152 1439.6693 1447.5778 1454.7610 1458.7133 1460.7991 1467.2262 1470.6188 1473.2905 1556.7174 1572.3039 1589.9423 1600.9314 1609.2535 2868.3638 2877.6063 2961.0028 2977.6830 3045.4876 3049.3924 3099.6871 3104.7561 3135.8471 3149.5562 3161.8461 3170.3555 3174.1065 3175.5720 3190.2183 3472.3101
redmass: 7.2421 7.4030 5.1654 3.7952 4.9133 4.7614 6.0403 5.3802 5.1327 5.8101 3.7502 3.7400 3.9545 3.8500 7.4837 6.6826 2.9189 5.1928 5.9659 2.3575 4.4876 3.0599 3.3475 3.8656 4.7053 2.9129 4.1160 4.2934 4.0285 4.3667 6.2021 7.6799 3.9065 5.8023 1.7136 5.7439 5.5865 5.7085 8.0016 2.3126 1.7936 5.7953 4.7566 3.9611 1.7713 1.5039 1.4879 3.2598 2.6733 1.3756 3.1142 1.4128 1.3118 1.3404 2.5234 2.0519 1.7325 1.8692 2.8164 2.3105 2.3004 2.0346 1.9284 2.2918 2.0234 1.1661 2.9323 2.9402 1.0967 5.8571 1.9847 1.6617 1.5052 1.5043 2.4482 1.3208 1.2762 1.2690 1.4543 5.9456 6.1712 1.7105 5.7136 2.9202 4.1335 2.6567 1.3526 2.4090 1.1600 1.1412 1.2073 1.5542 1.5080 6.6235 7.6574 9.1828 7.6532 7.4462 1.0713 1.0701 1.0696 1.0684 1.0894 1.0907 1.0920 1.0934 1.0854 1.0898 1.0948 1.0894 1.1007 1.0915 1.0971 1.0756
irintensity: 1.2921 0.8719 0.2899 0.8677 0.5714 0.9665 6.4953 1.0324 1.1842 2.9847 1.3649 3.7024 9.3751 5.7156 0.3827 3.3348 1.3369 4.8657 2.0922 18.4378 3.1764 3.7951 2.8935 3.2413 16.6970 37.2040 23.2761 1.5633 14.5952 15.0403 1.2678 3.8092 43.5495 5.9208 80.4840 9.5870 2.7051 2.0588 20.1871 22.5392 87.1082 10.4835 7.1751 10.1854 5.1634 30.7176 4.9125 5.3598 11.1397 5.6436 17.2880 32.5436 0.1127 0.9547 60.4897 6.7158 3.0858 16.6214 18.3010 104.2991 20.9798 32.3194 12.2217 12.0576 96.9098 24.0864 14.2118 91.7456 3.2011 338.2368 39.1712 38.5909 43.7718 81.8186 41.4083 24.8590 34.1511 8.3702 50.3079 23.2750 61.7765 12.6237 4.7441 128.4608 19.3481 25.6615 5.9651 64.8510 6.1046 9.8887 64.0571 6.5613 3.0973 94.2706 69.7474 459.9603 33.3978 12.0208 65.6026 108.2356 50.9753 48.0178 45.2859 53.8899 20.6671 7.8919 3.0138 9.6736 15.1316 1.2812 23.2791 2.9289 2.6636 0.1786
temp: 298.150 k
press: 1.00000 atm
elementType: 8 8 8 7 7 7 7 6 6 6 6 6 6 6 6 6 6 6 6 6 6 6 6 6 1 1 1 1 1 1 1 1 1 1 1 1 1 1 1 1
symmnumber: 1
zpe: 808184.2 jmol-1
zpe.correction: 0.307821 hartree
zpe.thermalcorrener: 0.327210 hartree
zpe.thermalcorrenthalpy: 0.328154 hartree
zpe.thermalcorrgfe: 0.259429 hartree
zpe.sumelectzpe: -1100.266608 hartree
zpe.sumelectthermal: -1100.247220 hartree
zpe.sumelectthermalent: -1100.246275 hartree
zpe.sumelectthermalfe: -1100.315001 hartree
dipole: -1.1950 2.2320 0.6507
dipole: 2.6140
quadrupole: -138.6725 -137.0094 -141.7170
quadrupole: 23.0451 9.4132 -13.0665
quadrupole: 0.4605 2.1236 -2.5840 23.0451 9.4132 -13.0665
hfenergy: -1100.5744292 hartree
pointgroup: C01 [X(C17H16N4O3)]
dipole: -0.4756921 0.8838718 0.2239803 debye
polarizability: 346.4119602|0.7993455|255.1111235|5.1079221|-23.8971543|142.9453735 unknown
InChI: InChI=1S/C17H16N4O3/c22-21(23)12-5-6-15-13(11-12)17(20-9-7-18-8-10-20)19-14-3-1-2-4-16(14)24-15/h1-6,11,18H,7-10H2
charge 0 multiplicity 1
40 atoms
O  -1.892796 -0.90071 1.420136
O  3.218198 -4.175676 -0.531959
O  3.764592 -2.098405 -1.301612
N  1.014814 1.87639 0.213541
N  3.256123 3.636823 0.20208
N  -1.245864 1.496166 -0.224644
N  2.973978 -2.91695 -0.688071
C  0.841472 3.294872 -0.185978
C  2.136467 1.684075 1.169953
C  2.162862 3.82729 -0.774853
C  3.447373 2.217556 0.562244
C  -0.068353 0.998134 0.114426
C  0.241181 -0.465925 0.25433
C  -0.668012 -1.357556 0.892471
C  1.432347 -1.008002 -0.282042
C  -2.441056 0.771792 -0.355669
C  -2.808629 -0.353352 0.443436
C  -0.360582 -2.726401 1.067572
C  1.715636 -2.378785 -0.123894
C  0.842078 -3.250492 0.565605
C  -3.433625 1.267815 -1.2502
C  -4.081823 -0.941779 0.380914
C  -4.708061 0.674604 -1.340953
C  -5.043976 -0.427966 -0.518331
H  0.556381 3.901676 0.697954
H  0.019307 3.34793 -0.915016
H  2.23742 0.622339 1.437974
H  1.917001 2.257614 2.095507
H  2.351569 3.3012 -1.743407
H  2.050471 4.906038 -0.986329
H  4.253615 2.137448 1.313273
H  3.722722 1.575408 -0.312002
H  4.128218 4.106783 -0.067802
H  2.137251 -0.372202 -0.824017
H  -1.084372 -3.357704 1.590025
H  1.106783 -4.304748 0.678435
H  -3.171147 2.141957 -1.854426
H  -4.304051 -1.788434 1.038073
H  -5.446444 1.080958 -2.040511
H  -6.039968 -0.879383 -0.569532
