program: Gaussian 09
title: 000210952
version: EM64L-G09RevD.01
frameworkgroup: C1[X(C10H25NO5P2S2)]
method: RPBEPBE
basis: SDD
operation: Freq
keyword: #p
keyword: freq=noraman
keyword: PBEPBE/SDD
title: #p freq=noraman PBEPBE/SDD
converged: NO YES NO NO
title: Mulliken charges:
elementType: S S P P O O O O O N C C C C C C C C C C H H H H H H H H H H H H H H H H H H H H H H H H H
charge: 0.064466 -0.230495 1.427648 0.580893 -0.539691 -0.499461 -0.627948 -0.457141 -0.474795 -0.770871 -0.271764 -0.651479 -0.256969 -0.236591 -0.362623 -0.374866 -0.674888 -0.659588 -0.472393 -0.517659 0.241739 0.273931 0.357103 0.314482 0.266456 0.213929 0.219818 0.205599 0.218564 0.214368 0.251248 0.196454 0.217682 0.228976 0.212865 0.206823 0.208861 0.256214 0.202155 0.240958 0.242565 0.239804 0.312121 0.227598 0.235903
chargesum: 0.00000
title: Mulliken charges with hydrogens summed into heavy atoms:
elementType: S S P P O O O O O N C C C C C C C C C C
charge: 0.064466 -0.230495 1.427648 0.580893 -0.539691 -0.499461 -0.627948 -0.457141 -0.474795 -0.413768 0.243906 -0.070542 0.176778 0.187573 0.102993 0.039270 -0.026224 0.007642 0.250934 0.257963
polarizability: 2.69841895e+02 -1.10419789e+01 1.98850028e+02 -1.88934812e+01 3.30582855e+00 2.01576312e+02
1716.lowfreq: -12.4133 -7.3915 -3.7715 -0.0012 0.0010 0.0020 15.6217 20.4226 23.6096
frequency: 14.8171 19.8866 22.6447 30.2487 35.8258 40.4716 46.3338 53.3401 68.8426 78.1047 83.5642 89.3257 114.0655 120.3154 125.7465 127.5757 129.5091 136.7742 145.3088 163.5601 191.0170 201.3988 202.4348 207.3258 216.0840 222.4984 235.3470 247.6820 269.4452 281.5282 301.8940 312.6239 328.3197 369.5848 375.7364 381.4390 399.5174 420.7986 458.5234 474.3499 498.1306 538.7811 618.4703 632.1131 663.9913 671.9155 682.6817 728.6687 763.3830 777.8807 809.1785 872.7137 879.5158 889.4937 903.1177 932.3921 942.0253 955.6235 958.9840 1000.9409 1032.2425 1042.0049 1049.7703 1062.8352 1101.0814 1106.2423 1107.3979 1116.4427 1121.0642 1126.8011 1137.0961 1143.2936 1151.7456 1165.6358 1222.1128 1231.3016 1236.9193 1268.0873 1286.3333 1288.0851 1309.1899 1345.7913 1348.1117 1354.5379 1364.7053 1388.2027 1392.5894 1393.4683 1419.2242 1433.5452 1437.4560 1452.8709 1454.4719 1459.1067 1464.1440 1465.1134 1467.3999 1468.2148 1474.3481 1477.6467 1480.5034 1484.7655 1491.0942 1491.5298 2965.5918 2977.0684 2978.3379 2979.5909 2983.4178 2984.1794 2986.1029 3003.9012 3010.3448 3029.7067 3034.7613 3045.2351 3046.6752 3066.4844 3073.0274 3081.5189 3083.8767 3087.0907 3088.0186 3088.1584 3094.4946 3117.5790 3121.0677 3130.2207 3569.4648
redmass: 4.0602 4.0092 4.3726 4.4008 3.7687 3.9686 2.8854 3.1200 2.5967 3.0611 2.5477 4.0634 2.6490 2.4165 2.1512 1.6508 1.9228 3.8347 2.7362 3.8186 2.4940 3.6223 3.9963 3.3553 1.6532 1.6870 3.4912 2.6373 7.8584 1.9552 5.3145 6.4395 5.7226 5.2547 1.9988 4.1770 2.7320 8.6655 3.1266 4.3001 4.0690 16.5102 4.6195 10.6099 5.3074 9.3496 5.6575 1.5101 1.0804 1.4919 2.8516 2.6328 1.7089 1.3021 1.6683 2.1728 10.0361 9.1617 6.4815 1.6698 5.0722 3.3347 3.9283 1.8424 2.0872 2.5590 1.4844 1.2437 2.2225 1.2965 1.6603 1.2871 1.5519 1.2582 1.2134 1.1944 1.2335 1.1982 1.1401 1.1300 1.2417 1.2967 1.2858 1.3800 1.3412 1.2479 1.2125 1.2036 1.1219 1.1061 1.0796 1.0780 1.0517 1.0626 1.0785 1.0666 1.0535 1.0521 1.0581 1.0423 1.0428 1.0649 1.0922 1.0550 1.0555 1.0371 1.0381 1.0284 1.0617 1.0299 1.0613 1.0601 1.0637 1.1050 1.0602 1.1008 1.1002 1.1014 1.0995 1.0993 1.0986 1.1050 1.1045 1.1044 1.1001 1.1072 1.1068 1.1032 1.0765
irintensity: 0.2158 1.0195 1.0380 0.0665 1.2914 0.4136 1.6251 0.1414 0.9786 1.5720 7.1975 2.6605 0.4791 2.7230 0.8625 2.7715 0.1574 0.1880 4.9324 0.5512 15.5975 7.9074 2.8622 5.4584 7.2026 11.5071 4.7057 1.4329 6.2283 5.6194 5.2221 4.8094 25.0082 5.4030 24.9348 15.5406 23.0173 22.1840 59.1348 45.4017 7.0314 108.2130 38.0278 85.2255 24.7942 164.7506 178.3380 55.6531 6.9927 16.5169 91.6062 11.3176 34.5968 11.3024 60.0671 101.7537 205.6087 105.8807 312.9027 19.8401 9.1316 35.1675 100.1859 4.3411 6.0534 70.6357 22.2767 2.9034 0.1258 0.2179 1.2632 0.4113 0.4393 20.5336 0.2675 5.4953 1.8845 4.4853 28.5662 0.6849 0.6316 4.4888 1.3270 2.7109 17.0575 45.9810 15.1016 11.7006 2.3109 6.1968 7.3590 7.8166 21.1357 16.3014 1.9725 9.8408 23.7540 15.9855 3.3699 6.7416 10.6428 10.6549 13.5266 21.6853 25.2702 29.8273 34.3072 38.7470 31.0433 42.9159 38.9643 23.6378 26.1642 39.1142 8.8973 25.5506 5.1931 5.6893 59.5173 1.8388 35.7700 70.9530 28.2402 24.4618 26.5917 8.3411 2.3346 12.2423 41.3710
temp: 298.150 k
press: 1.00000 atm
elementType: 16 16 15 15 8 8 8 8 8 7 6 6 6 6 6 6 6 6 6 6 1 1 1 1 1 1 1 1 1 1 1 1 1 1 1 1 1 1 1 1 1 1 1 1 1
symmnumber: 1
zpe: 941486.5 jmol-1
zpe.correction: 0.358593 hartree
zpe.thermalcorrener: 0.387872 hartree
zpe.thermalcorrenthalpy: 0.388816 hartree
zpe.thermalcorrgfe: 0.293448 hartree
zpe.sumelectzpe: -2303.821833 hartree
zpe.sumelectthermal: -2303.792554 hartree
zpe.sumelectthermalent: -2303.791610 hartree
zpe.sumelectthermalfe: -2303.886978 hartree
dipole: -5.0317 3.6201 1.9269
dipole: 6.4913
quadrupole: -159.5603 -147.2289 -146.7325
quadrupole: 5.3516 -6.5984 -2.6866
quadrupole: -8.3864 3.9450 4.4414 5.3516 -6.5984 -2.6866
hfenergy: -2304.180426 hartree
pointgroup: C01 [X(C10H25N1O5P2S2)]
dipole: 1.8483656 1.5237925 -0.8853224 debye
polarizability: 269.1119423|18.254428|201.5511005|-13.8497072|-4.0145302|199.6051922 unknown
InChI: InChI=1S/C10H25NO5P2S2/c1-5-8-15-17(12,16-9-6-2)11-7-10-20-18(19,13-3)14-4/h11H,5-10H2,1-4H3
charge 0 multiplicity 1
45 atoms
S  -2.774537 -2.160056 -2.045586
S  -5.057294 -1.994934 0.882716
P  1.865186 -0.350436 -0.154433
P  -3.543186 -1.090195 -0.185451
O  3.522123 -0.284795 -0.671207
O  1.393315 1.32041 -0.056257
O  1.48071 -1.058863 1.21599
O  -3.831766 0.460054 -0.918642
O  -2.105046 -0.652083 0.701929
N  1.250381 -1.085608 -1.583226
C  0.022412 -1.902872 -1.575622
C  -1.150463 -1.181201 -2.268202
C  4.514608 0.402626 0.20613
C  1.350204 2.170599 -1.277388
C  4.941502 -0.476407 1.390087
C  0.488761 3.388657 -0.926619
C  6.020237 0.227479 2.243751
C  -0.978048 3.018844 -0.626098
C  -4.381818 1.526914 -0.046347
C  -1.713732 -1.429754 1.907351
H  0.219061 -2.876408 -2.062296
H  -0.247041 -2.114271 -0.527076
H  1.879584 -1.133942 -2.386268
H  -1.304208 -0.175404 -1.848143
H  -1.018952 -1.101018 -3.36101
H  4.092082 1.366557 0.555616
H  5.361194 0.60522 -0.472682
H  0.906274 1.592746 -2.113738
H  2.383447 2.464977 -1.546924
H  5.329019 -1.436097 1.00015
H  4.055339 -0.712155 2.008183
H  0.543758 4.09871 -1.776962
H  0.940751 3.895872 -0.053365
H  6.322423 -0.411721 3.09191
H  5.644809 1.180787 2.661141
H  6.927467 0.449683 1.650449
H  -1.550049 3.910298 -0.310435
H  -1.026353 2.265322 0.178779
H  -1.477896 2.593657 -1.517377
H  -4.588425 2.3631 -0.730433
H  -3.639606 1.825627 0.714208
H  -5.316347 1.187461 0.436853
H  -0.65338 -1.172608 2.058451
H  -1.818834 -2.516983 1.73733
H  -2.342163 -1.127287 2.761959
