program: Gaussian 09
title: 000216316
version: EM64L-G09RevD.01
frameworkgroup: C1[X(C15H24N2O)]
method: RPBEPBE
basis: SDD
operation: Freq
keyword: #p
keyword: freq=noraman
keyword: PBEPBE/SDD
title: #p freq=noraman PBEPBE/SDD
converged: YES YES NO NO
title: Mulliken charges:
elementType: O N N C C C C C C C C C C C C C C C H H H H H H H H H H H H H H H H H H H H H H H H
charge: -0.254234 -0.481555 -0.274068 0.199928 0.170761 0.146571 0.397676 0.392373 -0.062168 -0.718165 -0.553421 0.192154 -0.829559 -0.861579 -0.847965 -0.848611 -0.701631 -0.664247 0.198641 0.232358 0.301987 0.205627 0.257639 0.277460 0.220455 0.280564 0.226292 0.252411 0.242774 0.229375 0.227430 0.236626 0.230814 0.230497 0.227599 0.234613 0.204875 0.205279 0.236804 0.206556 0.204728 0.226338
chargesum: 0.00000
title: Mulliken charges with hydrogens summed into heavy atoms:
elementType: O N N C C C C C C C C C C C C C C C
charge: -0.254234 -0.179568 0.003392 0.199928 0.170761 0.146571 0.397676 0.392373 0.136473 -0.485807 -0.090155 0.192154 -0.102248 -0.137019 -0.153095 -0.155903 -0.054673 -0.026624
polarizability: 2.31592770e+02 3.01865276e+00 1.93469857e+02 -1.28387735e+01 4.84151154e+00 1.30418615e+02
1716.lowfreq: -7.9655 -7.3245 0.0008 0.0009 0.0009 1.3059 24.6760 34.4982 47.5082
frequency: 24.6351 34.4236 47.2961 66.0778 71.3888 82.3101 97.8533 117.6710 149.4701 157.7338 165.0845 179.3115 195.2706 213.6590 221.4429 242.1143 254.4310 266.2901 298.3450 310.6468 325.6635 340.1573 348.1873 353.4885 362.5858 437.3643 439.0681 476.0314 506.8233 515.1174 541.1409 576.0250 585.6353 600.6451 636.1786 643.8837 682.9024 713.8984 756.0833 813.9261 829.8395 879.2718 906.0459 910.5499 914.6190 921.0240 937.3372 974.8162 994.3427 1018.1123 1023.5112 1029.3287 1046.1065 1052.9338 1056.8657 1077.2603 1083.8856 1128.2296 1129.8135 1149.0927 1177.9883 1195.3321 1234.4824 1249.2205 1265.8607 1304.0074 1315.7199 1320.3429 1344.0188 1361.1722 1373.1821 1390.6987 1392.6263 1394.2882 1401.0356 1403.1857 1405.9350 1430.1627 1437.5936 1455.9670 1457.9878 1460.6760 1461.9734 1463.6180 1465.7839 1468.6233 1476.2587 1483.0643 1484.4098 1485.3548 1486.3334 1490.8389 1504.0196 1585.5560 1618.6696 1626.8201 2952.1823 2956.4000 2961.6157 2969.8020 2970.8055 2971.1711 2978.0157 2983.3030 3019.3552 3037.9929 3044.7938 3047.4974 3061.0777 3062.8962 3069.6010 3080.4564 3081.1046 3082.2840 3092.3561 3095.4108 3099.3138 3115.4042 3425.8146 3507.3346
redmass: 3.6713 3.4824 2.6478 1.3677 2.6991 3.5945 3.3775 2.6297 1.9610 1.0637 1.2392 1.4713 1.9883 1.1334 2.7062 1.5109 3.2111 1.5750 2.6715 3.7224 2.8013 2.6381 3.2090 2.9125 2.1774 4.7597 2.0167 3.2723 4.1439 3.0671 2.8107 1.5762 3.3117 2.4221 3.3239 2.1512 4.4788 3.9919 3.7362 2.2514 3.0924 1.3221 2.1815 1.4431 1.9681 4.4460 1.3707 1.7090 1.3341 1.5191 1.4199 1.5045 2.0878 1.6356 1.7013 2.5239 2.6004 1.9511 2.4071 2.0211 2.4266 2.7509 4.4254 1.3775 1.5015 1.3235 1.3963 5.1483 1.2606 5.5517 1.2243 1.2239 1.2312 1.2744 1.2245 1.2880 3.0080 1.1330 1.7916 1.1300 1.1175 1.0714 1.1044 1.1174 1.0886 1.2318 1.0901 1.0606 1.0670 1.0661 1.1030 1.1160 2.1717 5.8048 7.0109 5.9434 1.0623 1.0458 1.0817 1.0380 1.0376 1.0381 1.0369 1.0371 1.0983 1.0898 1.0971 1.0962 1.0990 1.0966 1.0979 1.0980 1.0989 1.0997 1.0985 1.1001 1.0954 1.0910 1.0731 1.0756
irintensity: 0.0896 0.6254 0.1669 2.0682 0.8974 0.3827 3.8201 1.0065 4.7931 0.5756 0.0388 1.9519 4.5534 0.2923 2.2284 9.5181 12.9907 17.3447 1.0966 2.0926 1.2627 1.1084 0.8433 0.5710 2.4617 0.6017 13.1160 3.6168 3.9634 8.4823 8.1328 30.4860 0.0704 47.6173 67.9263 89.2273 5.3328 17.4371 2.5672 27.8393 7.8927 9.6894 6.4256 3.9617 3.3418 5.9229 0.3304 10.5833 4.4574 16.3968 1.5055 14.9826 6.1041 0.2418 1.1249 8.4947 1.6428 26.8956 12.6079 10.9080 50.4777 112.9685 19.5800 0.3557 4.3502 6.5221 2.9325 7.8080 4.5914 24.6583 16.4806 29.7547 1.5699 5.0327 30.1539 2.6858 3.7043 19.9649 173.3037 12.7399 18.4068 4.0209 4.5691 17.3001 26.5563 81.7098 7.6188 24.0171 5.0587 1.1662 7.2548 40.1354 45.9592 9.4331 16.5678 107.7197 41.1500 36.7405 36.4155 46.2415 29.1243 28.9095 25.8541 23.3267 21.8507 22.3413 17.2760 23.1134 68.9903 11.1236 33.9228 12.3346 35.0582 53.3136 19.3684 30.7115 15.7581 27.8050 1.5971 12.0496
temp: 298.150 k
press: 1.00000 atm
elementType: 8 7 7 6 6 6 6 6 6 6 6 6 6 6 6 6 6 6 1 1 1 1 1 1 1 1 1 1 1 1 1 1 1 1 1 1 1 1 1 1 1 1
symmnumber: 1
zpe: 947753.7 jmol-1
zpe.correction: 0.360980 hartree
zpe.thermalcorrener: 0.382074 hartree
zpe.thermalcorrenthalpy: 0.383018 hartree
zpe.thermalcorrgfe: 0.310856 hartree
zpe.sumelectzpe: -769.348026 hartree
zpe.sumelectthermal: -769.326932 hartree
zpe.sumelectthermalent: -769.325988 hartree
zpe.sumelectthermalfe: -769.398150 hartree
dipole: 1.3608 2.1794 2.1207
dipole: 3.3315
quadrupole: -108.9226 -104.6069 -110.3628
quadrupole: -4.4009 -1.6858 0.6120
quadrupole: -0.9585 3.3572 -2.3987 -4.4009 -1.6858 0.6120
hfenergy: -769.709006 hartree
pointgroup: C01 [X(C15H24N2O1)]
dipole: -0.6561038 -0.834982 0.7682942 debye
polarizability: 225.531865|4.4034068|193.165358|27.1302911|-5.9730325|136.7840192 unknown
InChI: InChI=1S/C15H24N2O/c1-9(2)16-8-14(18)17-15-12(5)10(3)7-11(4)13(15)6/h7,9,16-17H,8H2,1-6H3
charge 0 multiplicity 1
42 atoms
O  1.52403 1.403446 -0.494519
N  0.246183 0.288698 1.130107
N  3.922981 0.937132 1.05264
C  -1.006746 0.171274 0.42327
C  -1.677374 1.339907 -0.035756
C  -1.537827 -1.140961 0.245636
C  -2.907627 1.173349 -0.735945
C  -2.785152 -1.286826 -0.42082
C  4.536551 -0.367051 0.67759
C  -3.434779 -0.127212 -0.907527
C  2.591976 0.902174 1.66555
C  1.415006 0.875308 0.650504
C  -1.106904 2.71956 0.223376
C  -0.760902 -2.346034 0.752723
C  -3.670204 2.367544 -1.286322
C  -3.420466 -2.650459 -0.644946
C  5.965501 -0.092399 0.165006
C  3.73133 -1.207543 -0.353594
H  4.615241 -0.956438 1.615687
H  -4.388147 -0.242305 -1.438578
H  0.324122 -0.223825 2.012645
H  2.536922 0.043289 2.363529
H  2.450751 1.817871 2.277946
H  3.934879 1.599741 0.26234
H  -0.57885 2.754658 1.193083
H  -0.363164 2.985976 -0.550698
H  -1.894837 3.49039 0.232317
H  -1.120778 -3.281284 0.296304
H  0.315905 -2.250893 0.520898
H  -0.852252 -2.471401 1.851947
H  -4.022608 3.03972 -0.479898
H  -3.04169 2.97787 -1.961123
H  -4.556347 2.03865 -1.855289
H  -2.796689 -3.294453 -1.294799
H  -3.573329 -3.198673 0.303768
H  -4.404579 -2.546199 -1.132455
H  6.496818 -1.036904 -0.050078
H  5.936708 0.498239 -0.771523
H  6.538505 0.478388 0.915754
H  2.717227 -1.448287 0.017152
H  4.249342 -2.163206 -0.561044
H  3.616372 -0.654732 -1.303655
