program: Gaussian 09
title: 000210951
version: EM64L-G09RevD.01
frameworkgroup: C1[X(C13H7BrOS)]
method: RPBEPBE
basis: SDD
operation: Freq
keyword: #p
keyword: freq=noraman
keyword: PBEPBE/SDD
title: #p freq=noraman PBEPBE/SDD
converged: YES YES NO NO
title: Mulliken charges:
elementType: Br S O C C C C C C C C C C C C C H H H H H H H
charge: 0.093634 0.387665 -0.209311 -0.267846 0.348962 -0.258150 -0.375793 -0.387938 -0.036013 -0.218023 -0.218667 -0.231658 -0.518778 0.193516 -0.011964 -0.042531 0.269712 0.260875 0.246266 0.266854 0.237295 0.235157 0.236735
chargesum: 0.00000
title: Mulliken charges with hydrogens summed into heavy atoms:
elementType: Br S O C C C C C C C C C C C C C
charge: 0.093634 0.387665 -0.209311 -0.267846 0.348962 0.011561 -0.114917 -0.141671 0.230841 0.019272 0.016490 0.005076 -0.518778 0.193516 -0.011964 -0.042531
polarizability: 3.98891197e+02 -8.95995099e+00 1.73517230e+02 3.80737742e-01 3.19544911e-01 6.14583061e+01
1716.lowfreq: -1.4546 -0.0019 -0.0013 0.0012 3.5798 6.2300 21.1405 24.1477 31.9196
frequency: 21.0632 23.9681 31.9192 82.0060 95.3709 96.8369 136.5323 193.1104 232.4645 244.4911 260.0239 296.0453 389.0709 400.0279 438.0819 458.2711 493.6333 513.2786 549.1610 557.1796 604.7164 617.3023 664.3992 678.4101 694.2778 724.3529 759.3680 777.9162 814.1640 855.2568 911.3574 914.2388 936.0245 950.1869 984.5764 986.9976 1004.5601 1025.2319 1069.8871 1081.1549 1176.2528 1187.6043 1196.0658 1212.3618 1301.2572 1313.2483 1322.5051 1371.5691 1433.9708 1445.7246 1476.8318 1496.5108 1539.6051 1572.5973 1607.0609 2223.2737 3133.5777 3142.0044 3153.4071 3163.2154 3173.9299 3180.8824 3202.6608
redmass: 4.3523 7.4024 6.0053 8.0307 6.9374 12.8019 12.0031 6.9941 10.5515 10.1851 7.1613 15.8620 5.2548 2.8188 7.9050 7.0549 8.5640 8.9588 3.6875 3.5156 10.8505 6.7298 9.5525 7.1691 1.8286 6.8118 7.1738 1.7574 1.3033 1.2475 1.4290 5.2187 1.4254 8.6459 1.3857 6.2738 1.3313 2.1290 1.5435 1.6046 1.0579 1.1834 1.7761 2.4047 3.3623 1.3985 4.8004 5.5938 2.3532 7.5263 2.8473 6.3359 6.8258 5.5890 6.0225 11.9995 1.0852 1.0883 1.0931 1.0972 1.1017 1.0917 1.0999
irintensity: 0.5863 0.3755 0.3323 0.2361 0.9360 0.3240 1.6430 1.0680 9.9168 0.7884 0.9927 6.9588 0.0388 0.0131 6.6543 15.9149 10.9678 9.1665 3.1593 5.0233 7.4335 0.0481 13.4163 2.1692 45.2078 34.7228 33.0334 59.8847 47.0971 0.0009 0.1107 29.5415 5.4946 141.1590 0.0204 0.2887 0.0853 12.4485 47.6199 9.7265 0.1233 21.6907 8.4463 93.4230 4.1340 2.6882 258.8269 0.2444 13.6634 431.0065 44.9722 158.2245 128.2724 2.0968 0.2604 496.3439 1.0945 2.1829 15.2870 22.1036 23.8608 2.0518 1.1671
temp: 298.150 k
press: 1.00000 atm
elementType: 35 16 8 6 6 6 6 6 6 6 6 6 6 6 6 6 1 1 1 1 1 1 1
symmnumber: 1
zpe: 404296.1 jmol-1
zpe.correction: 0.153988 hartree
zpe.thermalcorrener: 0.168487 hartree
zpe.thermalcorrenthalpy: 0.169432 hartree
zpe.thermalcorrgfe: 0.108183 hartree
zpe.sumelectzpe: -985.164286 hartree
zpe.sumelectthermal: -985.149787 hartree
zpe.sumelectthermalent: -985.148842 hartree
zpe.sumelectthermalfe: -985.210091 hartree
dipole: 3.1395 -4.7864 0.0329
dipole: 5.7243
quadrupole: -77.2254 -108.8179 -113.3185
quadrupole: -1.3407 0.1068 0.2151
quadrupole: 22.5619 -9.0307 -13.5312 -1.3407 0.1068 0.2151
hfenergy: -985.318274 hartree
pointgroup: C01 [X(C13H7Br1O1S1)]
dipole: -1.3369979 -1.7704517 0.3871282 debye
dipolederiv: -0.8587284 0.1973531 -0.0510273 0.1904112 -0.0443407 0.0267508 -0.0495247 0.0269862 0.0629294 -0.0492654 -0.0264752 0.0037502 -0.1057357 -0.0809946 0.0641176 0.0207621 0.0649937 0.1965539 -0.934189 -0.0684573 0.0113304 0.0219775 -0.9654405 0.1457615 -0.0034854 0.1464812 -0.3495467 -0.5463203 0.5469679 -0.1245798 1.2269617 -0.3922346 0.0632138 -0.2777293 0.0578251 -0.1661564 -0.1692363 -0.0473181 0.0091095 -0.0461518 0.0441624 -0.0031919 0.0084528 -0.0032345 0.0314335 0.2757823 -0.1032259 0.0259427 -0.7194639 0.0408408 -0.0336884 0.1639751 -0.0292905 -0.0793416 0.0319728 0.1025099 -0.023521 -0.1975241 0.038658 -0.0452885 0.048198 -0.0419546 -0.1216703 0.0192517 -0.0855921 0.024789 0.1808777 0.0137323 -0.0379209 -0.0388613 -0.039947 -0.1325423 -1.0475356 0.0362133 -0.0152716 -0.1328473 -0.0221961 -0.0193401 0.0214543 -0.0179242 -0.1002135 -0.0236185 -0.1586949 0.0420028 -0.2527062 -0.0360886 -0.0286141 0.0662164 -0.0280485 -0.1295777 -0.2501217 0.0695663 -0.0186281 0.1677795 0.1188277 -0.0629287 -0.0449466 -0.0642459 -0.1235815 0.0540984 0.0285863 -0.0037153 -0.001452 -0.0043482 -0.0351856 0.0034582 -0.0348646 -0.1355262 1.4078785 -0.3150352 0.0829594 0.1911075 0.2616083 -0.1162901 -0.0294872 -0.1205327 -0.2401883 2.8975678 -0.1183511 0.044375 -0.4049289 1.1837994 -0.215541 0.1042241 -0.2146268 0.2871162 1.0904902 0.2044802 -0.0387056 0.3088839 -0.0299505 0.0125891 -0.0616937 0.0111962 0.0052658 -1.9973975 -0.2496164 0.0430692 -0.3885716 -0.200845 0.0169946 0.07446 0.0187884 -0.1148068 0.0110992 -0.057191 0.0114858 -0.1102371 0.0817892 0.022001 0.023992 0.0225594 0.1787944 0.1040949 -0.0539994 0.0125025 -0.0329396 -0.02533 0.0456432 0.0074519 0.045116 0.1460475 0.0202631 0.0955028 -0.0262189 0.0848873 0.0250549 0.0337147 -0.0233931 0.033622 0.1452642 0.0875555 0.0144493 -0.00396 0.0524108 -0.0148375 0.047857 -0.0125399 0.0476505 0.1876259 -0.0540502 0.0835135 -0.0241354 0.1116444 0.0075824 0.0403127 -0.0310592 0.040046 0.1505834 0.0467091 -0.0431282 0.0093785 -0.0873431 -0.0817523 0.0601881 0.0199643 0.0605173 0.1459316 -0.1163006 -0.0520576 0.0090681 -0.0570402 0.0823034 0.0188453 0.0101111 0.0188872 0.1556056 unknown
polarizability: 399.1723889|-2.8115369|167.3767525|3.3621869|-24.8691098|67.3175912 unknown
InChI: InChI=1S/C13H7BrOS/c14-13-9-8-12(16-13)11(15)7-6-10-4-2-1-3-5-10/h1-5,8-9H
charge 0 multiplicity 1
23 atoms
Br 6.498002 -1.031759 0.172095
S  4.021083 0.975456 -0.294115
O  1.429662 2.532344 -0.666168
C  2.32008 0.357089 -0.168945
C  -2.687149 0.023805 -0.129242
C  2.293198 -1.005357 0.134851
C  -3.711514 0.983914 -0.386514
C  -3.05553 -1.313858 0.20243
C  3.589697 -1.600791 0.276968
C  -5.06756 0.609929 -0.313046
C  -4.414529 -1.678301 0.274117
C  -5.42399 -0.719773 0.016925
C  4.613382 -0.680484 0.079101
C  1.215989 1.302958 -0.38995
C  -1.311746 0.410161 -0.206177
C  -0.126888 0.770535 -0.279261
H  1.356604 -1.555762 0.250277
H  -3.427844 2.01026 -0.640704
H  -2.271081 -2.051785 0.400411
H  3.76347 -2.652077 0.512345
H  -5.847406 1.35258 -0.512193
H  -4.689262 -2.707217 0.529706
H  -6.479668 -1.006666 0.073192
