program: Gaussian 09
title: 000210948
version: EM64L-G09RevD.01
frameworkgroup: C1[X(C5H9Br)]
method: RPBEPBE
basis: SDD
operation: Freq
keyword: #pfreq=noraman
keyword: PBEPBE/SDD
title: #p freq=noraman PBEPBE/SDD
converged: YES YES NO NO
title: Mulliken charges:
elementType: Br C C C C C H H H H H H H H H
charge: -0.056971 -0.443571 0.005985 -0.650616 -0.212115 -0.724056 0.233810 0.216317 0.237951 0.218580 0.222836 0.227405 0.221655 0.252043 0.250746
chargesum: 0.00000
title: Mulliken charges with hydrogens summed into heavy atoms:
elementType: Br C C C C C
charge: -0.056971 0.006557 0.005985 0.028752 0.015290 0.000387
polarizability: 7.79897204e+01 -3.50500657e+00 8.60586499e+01 -3.43195452e+00 -1.68687952e+00 4.48719346e+01
1716.lowfreq: -60.5534 -15.9470 -11.6553 -7.6599 -0.0002 0.0004 0.0005 71.4119 157.9142
frequency: -60.4636 71.3883 157.9129 178.1474 201.5067 286.5090 334.4753 442.4930 484.5497 549.1468 772.5819 799.3550 891.2323 969.1449 1031.3255 1055.8924 1066.7460 1108.9863 1128.2548 1235.5733 1291.6624 1316.0835 1388.2111 1397.4272 1451.0663 1465.7782 1468.8884 1472.2321 1485.2451 1677.4930 2979.2252 2979.7918 2987.9053 3034.9793 3057.1068 3082.4675 3086.2074 3094.5394 3102.2984
redmass: 1.0179 2.3782 3.1010 3.5014 1.2211 2.1152 2.6583 3.8958 4.0182 3.1151 1.1924 1.2061 1.8978 2.1881 1.4647 1.5423 2.0121 2.4038 2.3487 1.1860 1.2057 1.4319 1.1964 1.1959 1.0801 1.0454 1.0535 1.0417 1.0544 8.4206 1.0556 1.0399 1.0359 1.1009 1.0972 1.0911 1.1001 1.1011 1.0965
irintensity: 0.4055 0.3107 1.2929 0.8524 0.4322 1.5863 0.3968 9.0093 16.6861 10.1334 8.2598 27.8544 55.4504 5.9776 0.2419 0.4630 6.3061 3.3081 29.2178 1.5099 20.5113 5.7816 12.1464 10.5463 9.7692 14.6350 12.5219 12.2961 12.0153 17.4610 23.9772 26.2333 30.2681 11.4999 17.9965 17.6263 40.0761 26.6066 33.5528
temp: 298.150 k
press: 1.00000 atm
elementType: 35 6 6 6 6 6 1 1 1 1 1 1 1 1 1
symmnumber: 1
zpe: 326483.8 jmol-1
zpe.correction: 0.124351 hartree
zpe.thermalcorrener: 0.131753 hartree
zpe.thermalcorrenthalpy: 0.132697 hartree
zpe.thermalcorrgfe: 0.091518 hartree
zpe.sumelectzpe: -208.884472 hartree
zpe.sumelectthermal: -208.877071 hartree
zpe.sumelectthermalent: -208.876126 hartree
zpe.sumelectthermalfe: -208.917305 hartree
dipole: 0.5317 2.0054 -0.1134
dipole: 2.0778
quadrupole: -43.5420 -44.6124 -48.6531
quadrupole: -0.4673 -1.2293 -0.3885
quadrupole: 2.0605 0.9901 -3.0506 -0.4673 -1.2293 -0.3885
hfenergy: -209.0088232 hartree
pointgroup: C01 [X(C5H9Br1)]
dipole: 0.0801981 0.7966439 -0.1648008 debye
dipolederiv: -0.1639257 -0.0866985 0.0399733 -0.0325013 -0.6584627 0.1402929 0.0384318 0.1594638 -0.1175211 0.0130031 0.0441915 0.0020289 -0.041988 -0.1005031 0.0817613 -0.0055184 0.0896766 0.1184806 0.1565092 0.047809 -0.1038772 0.0659612 1.1066527 -0.2912465 -0.1527668 -0.3461617 -0.144214 -0.0152882 0.010561 -0.0533381 -0.0442434 0.0730732 0.0073664 0.0270738 0.0209245 0.0195788 0.0382381 -0.0330038 -0.0699864 0.1983553 -0.3300458 -0.022624 -0.1020583 0.0447701 -0.173127 -0.0778977 -0.0874067 0.052074 -0.1522165 0.1139652 0.0238202 0.0793792 0.0106905 0.0584495 -0.0045303 0.0312268 0.0387482 0.0317928 0.0252465 -0.1282727 0.0494518 -0.0948379 -0.0501214 0.0070571 -0.0228736 -0.0121102 -0.0086744 -0.1281154 0.1199557 -0.01187 0.0863968 0.0477136 0.1188931 -0.0084445 -0.0078124 0.0436964 -0.0941801 0.0935561 -0.0290113 0.0546421 0.0497553 -0.1953746 -0.065693 0.0532736 -0.0713994 0.0859725 0.0214399 0.0654878 0.0274123 0.0485055 0.0729722 0.062067 0.0492602 0.0254093 -0.0068806 -0.1240188 -0.0063069 -0.1037496 -0.0603557 0.0311781 -0.0022406 0.0404858 -0.0763614 -0.0992962 0.0826555 0.0568352 0.0680959 0.1471394 -0.0160027 0.0992823 0.0055717 0.1630119 -0.0816042 0.0118258 -0.0077637 0.0248288 0.1145371 0.0007904 -0.0153304 -0.0243857 -0.0882867 0.0059948 -0.0986422 -0.0505062 -0.085389 0.030144 0.034378 0.0265537 -0.0099056 -0.0125558 0.0881832 0.0821306 0.049142 0.043237 -0.0889646 unknown
polarizability: 79.1594535|-5.1422355|83.2841705|-3.0681518|-7.7951853|46.4766809 unknown
InChI: InChI=1S/C5H9Br/c1-3-5(6)4-2/h3H,4H2,1-2H3
charge 0 multiplicity 1
15 atoms
Br -0.255819 -1.865579 0.315227
C  1.405627 0.384433 -0.618033
C  -0.006709 0.044573 -0.198715
C  2.444287 0.310652 0.529376
C  -1.075314 0.87653 -0.141063
C  -2.48667 0.53868 0.28362
H  1.719725 -0.289578 -1.438509
H  1.38629 1.411858 -1.033238
H  2.498619 -0.709729 0.946831
H  3.447749 0.583116 0.155305
H  2.17707 1.002631 1.347618
H  -0.872868 1.915823 -0.44214
H  -3.140806 1.42409 0.222466
H  -2.917275 -0.255816 -0.354504
H  -2.512907 0.158414 1.322259
