program: Gaussian 09
title: 000216281
version: EM64L-G09RevD.01
frameworkgroup: C1[X(C11H15NO2)]
method: RPBEPBE
basis: SDD
operation: Freq
keyword: #p
keyword: freq=noraman
keyword: PBEPBE/SDD
title: #p freq=noraman PBEPBE/SDD
converged: YES YES NO NO
title: Mulliken charges:
elementType: O O N C C C C C C C C C C C H H H H H H H H H H H H H H H
charge: -0.210503 -0.255348 -0.327366 -0.128000 0.114562 0.303934 -0.733593 -0.360717 -0.341216 -0.646633 -0.375432 -0.354120 0.323887 -0.537029 0.191832 0.254057 0.210333 0.236543 0.262040 0.233230 0.280600 0.267948 0.213923 0.181693 0.241464 0.255402 0.224524 0.224289 0.249699
chargesum: 0.00000
title: Mulliken charges with hydrogens summed into heavy atoms:
elementType: O O N C C C C C C C C C C C
charge: -0.210503 -0.255348 -0.065326 0.063832 0.114562 0.303934 -0.032660 -0.127487 -0.060617 0.016931 -0.133969 -0.098719 0.323887 0.161483
polarizability: 2.13395407e+02 6.32325606e+00 1.24532087e+02 -2.84445877e+00 -6.96590378e+00 8.43062919e+01
1716.lowfreq: -10.7748 -4.4662 -2.7522 0.0008 0.0008 0.0010 35.9361 49.4702 79.1238
frequency: 35.6471 49.3917 79.1178 108.0084 132.0250 137.5208 184.6542 202.4519 210.8507 222.0368 232.2683 257.7924 299.9068 321.5916 346.8720 413.1028 421.9469 458.7318 467.6769 506.2936 518.6771 598.2005 628.8298 673.2056 731.4801 758.4183 777.1178 811.5251 856.1933 878.7071 942.6844 954.4350 983.7947 995.9525 1001.4173 1004.0603 1061.1147 1069.2227 1109.8655 1111.8984 1115.4964 1154.4712 1170.0562 1179.3371 1215.4722 1232.8164 1240.3256 1268.9976 1300.5978 1347.6669 1373.5253 1379.8715 1427.0324 1433.9452 1435.7467 1449.0564 1464.4930 1467.6827 1471.4424 1477.0472 1482.2355 1495.3962 1500.6091 1555.7174 1591.3170 1618.3929 2816.1569 2864.3509 2965.2367 2983.4888 3032.9458 3055.6589 3078.5930 3088.9480 3108.1003 3130.4989 3141.1334 3150.6817 3165.0382 3172.1933 3491.8118
redmass: 4.2402 3.1632 4.1916 3.3968 3.2402 2.5352 3.0943 1.3804 1.6620 1.1357 1.6816 2.7786 4.7434 4.2832 2.7737 2.9309 2.6244 4.9553 3.7206 2.4743 2.0087 4.8999 6.7982 3.9796 3.5806 3.5170 4.7950 1.3640 1.5470 2.1727 1.4561 2.6177 7.3463 1.4770 2.0512 2.2299 2.5073 1.4961 1.2928 1.2609 1.3212 1.3279 2.3267 1.3738 2.5853 2.6125 2.5110 1.6181 1.3206 1.5142 4.2853 1.2304 3.7919 1.2249 1.1725 1.1649 1.0425 1.0532 1.0776 1.0705 1.1075 2.1729 1.0972 7.5128 8.2272 6.4700 1.0783 1.0576 1.0328 1.0375 1.0725 1.1042 1.0967 1.1009 1.1004 1.0996 1.0875 1.0881 1.0949 1.0970 1.0755
irintensity: 0.5967 0.0692 0.2741 0.9458 8.6971 1.7952 0.7270 2.5987 1.4778 0.7905 2.4537 9.3644 1.3033 2.1952 17.5475 0.5047 50.3902 0.5315 4.1571 56.7119 57.5586 20.5520 0.7017 15.6744 3.2917 4.3977 0.7759 20.4807 56.6711 15.8318 10.6288 75.1827 42.6815 2.8673 7.9814 9.4042 7.0519 19.0615 13.0651 0.7454 13.4216 16.0612 168.1281 90.4044 37.0964 182.4695 106.8758 16.4366 3.3171 13.6902 2.5687 22.7726 30.9510 14.7046 7.7389 12.5577 1.9374 17.6699 41.7682 13.2770 16.1022 42.2149 8.7109 133.3298 101.5675 129.3135 87.7930 151.9630 66.3888 33.7453 39.8742 44.5876 28.0184 31.6480 24.5541 25.0112 8.5401 0.0496 14.0112 6.7398 0.2070
temp: 298.150 k
press: 1.00000 atm
elementType: 8 8 7 6 6 6 6 6 6 6 6 6 6 6 1 1 1 1 1 1 1 1 1 1 1 1 1 1 1
symmnumber: 1
zpe: 625935.7 jmol-1
zpe.correction: 0.238406 hartree
zpe.thermalcorrener: 0.253173 hartree
zpe.thermalcorrenthalpy: 0.254117 hartree
zpe.thermalcorrgfe: 0.196444 hartree
zpe.sumelectzpe: -632.275598 hartree
zpe.sumelectthermal: -632.260831 hartree
zpe.sumelectthermalent: -632.259887 hartree
zpe.sumelectthermalfe: -632.317560 hartree
dipole: -2.8204 -4.8896 1.4087
dipole: 5.8179
quadrupole: -73.0261 -80.9401 -85.2451
quadrupole: -2.3072 1.2776 -0.4025
quadrupole: 6.7110 -1.2030 -5.5080 -2.3072 1.2776 -0.4025
hfenergy: -632.5140039 hartree
pointgroup: C01 [X(C11H15N1O2)]
dipole: -1.0668303 1.9999795 -0.3180822 debye
polarizability: 212.7312995|-9.4733399|125.9583454|-5.1060249|-2.7588569|83.5441413 unknown
InChI: InChI=1S/C11H15NO2/c1-8(12-2)11(13)9-4-6-10(14-3)7-5-9/h4-8,12H,1-3H3
charge 0 multiplicity 1
29 atoms
O  2.054875 -1.682179 0.087423
O  -4.144973 -0.070706 0.087618
N  3.877145 0.374944 -0.405981
C  2.50455 0.730518 -0.044165
C  1.577184 -0.511982 0.019354
C  0.089524 -0.303016 0.02141
C  2.512875 1.42058 1.347091
C  -0.5427 0.950047 -0.196888
C  -0.74004 -1.441139 0.252134
C  4.095795 -0.213762 -1.735287
C  -1.947497 1.07617 -0.184168
C  -2.135303 -1.333907 0.27084
C  -2.748229 -0.070772 0.052239
C  -4.837283 1.203946 -0.130656
H  2.049639 1.438995 -0.786412
H  2.926933 0.725462 2.097505
H  3.150749 2.324803 1.318749
H  1.501236 1.724242 1.662969
H  4.542367 1.116574 -0.164623
H  0.055082 1.846253 -0.392327
H  -0.247947 -2.405773 0.413833
H  3.625135 -1.210567 -1.777958
H  5.179193 -0.3495 -1.899535
H  3.690926 0.400799 -2.578182
H  -2.402222 2.054966 -0.362677
H  -2.776151 -2.202482 0.449476
H  -4.617641 1.611723 -1.13605
H  -4.562517 1.946572 0.642892
H  -5.907502 0.964494 -0.052528
