program: Gaussian 09
title: 000216303
version: EM64L-G09RevD.01
frameworkgroup: C1[X(C13H16N2O)]
method: RPBEPBE
basis: SDD
operation: Freq
keyword: #p
keyword: freq=noraman
keyword: PBEPBE/SDD
title: #p freq=noraman PBEPBE/SDD
converged: YES YES NO NO
title: Mulliken charges:
elementType: O N N C C C C C C C C C C C C C H H H H H H H H H H H H H H H H
charge: -0.284664 -0.406759 -0.381938 0.367765 -0.530982 0.088946 0.232137 -0.367109 -0.427628 -0.417926 -0.346706 -0.255718 -0.218303 0.253587 -0.495172 -0.666805 0.209942 0.225606 0.258917 0.216482 0.269361 0.306455 0.248674 0.325664 0.228616 0.224154 0.223649 0.234870 0.209179 0.253443 0.211035 0.211225
chargesum: 0.00000
title: Mulliken charges with hydrogens summed into heavy atoms:
elementType: O N N C C C C C C C C C C C C C
charge: -0.284664 -0.100303 -0.056275 0.367765 -0.095434 0.088946 0.232137 0.108290 -0.158267 -0.169252 -0.118090 -0.031564 0.005347 0.253587 -0.051123 0.008898
polarizability: 1.78286355e+02 -1.15843398e-01 1.87465333e+02 2.34464623e+01 3.10127898e+00 9.67522317e+01
1716.lowfreq: -8.9119 -8.3930 -3.6834 -0.0009 -0.0007 -0.0004 20.6170 28.6015 41.5796
frequency: 19.8700 28.5964 41.5693 51.3040 94.0071 110.6794 183.0746 198.8538 211.8227 216.6932 244.2957 299.7117 336.9632 417.6232 426.3800 454.7040 461.4957 510.7932 532.7048 552.6067 568.2622 576.3757 610.1921 641.6136 675.7990 693.6441 748.5358 751.7217 766.5369 790.4343 799.6687 818.5380 854.3910 866.5761 883.1656 935.7983 952.4469 973.9295 998.5161 1011.8414 1040.2752 1053.9691 1071.3818 1077.0013 1095.7351 1109.2709 1132.2130 1165.9424 1182.3340 1206.7498 1236.5848 1240.6406 1256.5241 1265.9731 1294.0830 1317.6005 1337.3646 1349.5280 1355.5419 1387.7862 1390.3453 1420.9310 1449.2610 1457.7483 1461.9527 1465.1706 1471.4157 1481.1510 1487.0238 1490.9687 1558.3656 1583.3444 1618.8242 1629.7730 2980.0889 2981.4046 2989.3057 2990.4532 3033.8528 3048.3516 3070.4975 3084.1821 3103.0812 3124.0973 3131.4103 3145.2405 3163.1572 3218.7502 3536.7900 3611.9143
redmass: 4.1545 4.1685 5.0182 2.7327 3.9966 3.0056 2.6471 2.3673 1.6171 4.0330 2.5366 4.3115 3.4029 2.9667 2.8029 3.3564 2.8555 1.3307 3.6472 4.3176 3.3897 2.8441 1.2624 2.7939 3.2007 4.0787 4.0869 1.3350 4.0515 1.4608 1.4235 2.2443 1.4446 5.1630 2.7523 1.3693 2.7851 1.2924 2.1131 2.1683 1.9140 1.9551 3.2758 1.9788 1.5793 2.9128 1.4593 1.1287 1.2836 1.5378 2.2292 1.4107 1.3515 1.3187 2.0051 1.4250 1.5360 1.8126 1.4104 1.1991 5.1152 2.3274 1.0931 3.2671 1.1268 1.1815 1.0454 3.0308 1.0923 1.7570 5.9892 6.1081 6.0268 6.8226 1.0588 1.0651 1.0601 1.0371 1.1009 1.1004 1.0988 1.1005 1.1001 1.0849 1.0890 1.0952 1.1001 1.0983 1.0777 1.0809
irintensity: 0.6650 0.9213 7.6896 1.4198 1.5355 6.2973 1.2022 1.0838 2.3212 9.3091 2.5000 8.7188 4.3842 1.5319 20.7916 4.5275 0.5879 82.1914 3.0701 8.6444 23.4580 17.3054 126.9048 6.7653 0.0321 0.6204 5.7122 110.0885 3.2734 14.5530 11.7291 11.2898 0.2357 0.8902 5.7179 2.5976 4.6600 0.1016 2.5150 10.5981 18.2938 5.8764 4.9712 4.9909 37.6427 4.9369 2.9829 6.1182 24.5520 21.9685 21.9818 51.1684 5.9569 21.9266 2.0620 6.6794 12.0786 18.0775 8.5191 22.6943 43.6253 3.6845 12.9085 16.5025 40.2445 28.4363 17.4386 2.2809 18.8767 215.6926 2.9620 0.3184 197.3900 2.7555 38.7043 29.9567 37.1524 26.2810 19.4156 28.3682 7.3950 48.8449 21.4322 1.8928 3.5092 36.0084 24.8804 0.9645 33.8004 64.1191
temp: 298.150 k
press: 1.00000 atm
elementType: 8 7 7 6 6 6 6 6 6 6 6 6 6 6 6 6 1 1 1 1 1 1 1 1 1 1 1 1 1 1 1 1
symmnumber: 1
zpe: 697824.1 jmol-1
zpe.correction: 0.265787 hartree
zpe.thermalcorrener: 0.280966 hartree
zpe.thermalcorrenthalpy: 0.281910 hartree
zpe.thermalcorrgfe: 0.221084 hartree
zpe.sumelectzpe: -688.564723 hartree
zpe.sumelectthermal: -688.549544 hartree
zpe.sumelectthermalent: -688.548600 hartree
zpe.sumelectthermalfe: -688.609427 hartree
dipole: -5.2752 -0.0872 -2.1560
dipole: 5.6994
quadrupole: -99.9311 -85.3253 -96.1496
quadrupole: 12.5425 3.7813 1.6055
quadrupole: -6.1291 8.4767 -2.3475 12.5425 3.7813 1.6055
hfenergy: -688.8305103 hartree
pointgroup: C01 [X(C13H16N2O1)]
dipole: -2.1028739 0.0625417 0.7759388 debye
polarizability: 179.8021843|-0.0659541|187.5095122|-20.5556896|2.6193714|95.1922231 unknown
InChI: InChI=1S/C13H16N2O/c1-2-13(16)14-8-7-10-9-15-12-6-4-3-5-11(10)12/h3-6,9,14-15H,2,7-8H2,1H3
charge 0 multiplicity 1
32 atoms
O  4.043066 0.902386 -0.033261
N  -3.07049 1.248565 0.54419
N  1.820492 0.749058 0.651474
C  -0.983827 1.467172 -0.379115
C  0.310368 2.072857 -0.872081
C  -1.336574 0.053528 -0.341018
C  -2.649938 -0.051575 0.244712
C  1.439966 2.093918 0.198393
C  -2.068921 2.156494 0.165603
C  -0.678146 -1.135912 -0.761325
C  -3.3024 -1.291305 0.427792
C  -1.324925 -2.374178 -0.583246
C  -2.621468 -2.451859 0.008538
C  3.100565 0.236831 0.498821
C  3.305443 -1.184603 1.042485
C  4.16983 -2.040641 0.091314
H  0.138758 3.118324 -1.193143
H  0.679578 1.522092 -1.75794
H  2.355196 2.55036 -0.217802
H  1.108695 2.700798 1.06425
H  -2.20355 3.228215 0.303624
H  -3.967157 1.49867 0.954629
H  0.311938 -1.088035 -1.22887
H  1.091271 0.152043 1.047847
H  -4.300702 -1.355949 0.875179
H  -0.830762 -3.296701 -0.907624
H  -3.09728 -3.430801 0.134028
H  3.823793 -1.090058 2.017424
H  2.33311 -1.675955 1.240924
H  5.101078 -1.50125 -0.150232
H  4.426939 -3.008605 0.557162
H  3.640758 -2.242986 -0.857527
