program: Gaussian 09
title: 000210942
version: EM64L-G09RevD.01
frameworkgroup: C1[X(C19H20F3N3O2)]
method: RPBEPBE
basis: SDD
operation: Freq
keyword: #p
keyword: freq=noraman
keyword: PBEPBE/SDD
title: #p freq=noraman PBEPBE/SDD
converged: YES YES NO NO
title: Mulliken charges:
elementType: F F F O O N N N C C C C C C C C C C C C C C C C C C C H H H H H H H H H H H H H H H H H H H H
charge: -0.164386 -0.166177 -0.164054 -0.241625 -0.290715 -0.146738 -0.246980 -0.013984 -0.376664 -0.365868 -0.537932 -0.482164 0.263691 -0.289606 -0.301355 0.433130 0.413741 -0.504012 -0.377695 0.322714 -0.322923 -0.322520 -0.206036 -0.372452 0.247688 -0.341039 -0.351911 0.234539 0.237386 0.266761 0.228911 0.266955 0.245670 0.264563 0.267397 0.226806 0.194671 0.202417 0.228003 0.305786 0.245490 0.261840 0.241304 0.237769 0.267679 0.242096 0.239828
chargesum: 0.00000
title: Mulliken charges with hydrogens summed into heavy atoms:
elementType: F F F O O N N N C C C C C C C C C C C C C C C C C C C
charge: -0.164386 -0.166177 -0.164054 -0.241625 -0.290715 -0.146738 -0.246980 -0.013984 0.095261 0.129804 -0.025306 0.049795 0.263691 0.131871 0.129065 0.433130 0.413741 -0.198225 -0.132205 0.322714 -0.061083 -0.081215 0.031732 -0.104772 0.247688 -0.098943 -0.112083
polarizability: 2.85641769e+02 -2.11922051e+01 2.66467291e+02 -1.65828316e+01 7.07288825e+00 1.68778120e+02
1716.lowfreq: -8.7916 -3.9737 -0.0006 -0.0005 -0.0003 3.2391 15.0915 15.9929 18.5079
frequency: 14.9120 15.8875 18.2471 20.6138 43.1862 54.3756 60.7834 70.6171 76.3156 104.3710 128.0112 133.5668 162.6478 185.7271 206.0798 229.0560 241.7870 280.6264 296.2545 309.4489 321.0449 327.9392 342.6222 363.6694 377.4456 381.5676 398.8625 415.6072 431.9023 449.2071 476.0189 479.3447 513.4171 527.6501 543.8447 557.8653 576.6361 593.2968 607.5694 628.8403 638.1750 659.5289 684.4156 697.3729 735.9128 748.8460 781.6606 794.4512 798.0975 806.4839 818.1512 833.9127 851.2948 892.9885 897.5756 902.8950 920.8515 939.3357 952.7402 958.1057 970.3177 978.6955 983.5093 984.1029 1010.0165 1013.9418 1016.5879 1038.9168 1048.3344 1050.7762 1056.0363 1061.1886 1071.4556 1085.1471 1107.3669 1110.0596 1112.1387 1174.4194 1182.3259 1190.0297 1195.0935 1215.0495 1227.3485 1236.5408 1257.3185 1274.4802 1277.6294 1286.6141 1291.5977 1299.4225 1315.0143 1329.4042 1338.8634 1345.1019 1354.4176 1356.9078 1369.6591 1374.2091 1386.6365 1413.6803 1419.7505 1445.7092 1447.9998 1451.9705 1455.5092 1457.5499 1463.9740 1470.9874 1485.3573 1493.7313 1539.0232 1576.7002 1577.6407 1592.3852 1618.9556 2950.5265 2961.8419 2979.6014 2982.5901 2988.2566 3032.5833 3041.9241 3085.8585 3086.9335 3092.6989 3095.8129 3109.9597 3128.1948 3133.6809 3142.9377 3161.1911 3167.9564 3170.7664 3173.5990 3179.5287
redmass: 15.3701 6.7844 6.0731 5.3024 6.5066 4.2667 4.8211 5.3666 5.6318 5.5370 7.2874 6.3558 2.7148 5.1372 3.2864 6.1029 4.1722 3.2035 3.4018 6.0207 5.0649 5.7866 5.1437 4.0399 3.3779 3.5606 1.9086 5.0221 5.1289 2.8476 4.7992 5.2638 6.1856 4.7866 2.7537 4.0646 3.7506 4.2729 9.5045 3.4649 4.2542 6.8839 6.2738 2.1910 3.5958 5.1286 2.3300 2.9812 1.5016 2.4080 1.6644 1.6687 1.3060 3.0909 2.6804 1.4116 1.4575 3.2242 1.3512 6.7252 1.4723 1.4124 6.0005 6.8032 2.3757 3.4389 5.7481 3.9735 2.2978 2.2114 2.0527 3.1285 3.5590 2.4070 1.8506 1.9699 1.8089 1.3403 2.9215 1.0884 1.0660 1.5587 1.3998 2.1593 1.5719 1.2649 1.9560 1.3172 1.7264 2.6121 1.7835 1.2412 1.4702 1.2217 1.5056 1.5225 1.2931 1.8585 5.8235 2.4124 2.9137 3.0722 1.0854 1.1444 1.1210 1.0962 1.1224 2.1185 2.5641 1.1066 6.7373 7.3820 5.8443 6.1717 6.2778 1.0684 1.0681 1.0669 1.0602 1.0648 1.0958 1.0694 1.0957 1.0965 1.0991 1.0938 1.0991 1.0888 1.0904 1.0869 1.0931 1.0932 1.0933 1.0949 1.0982
irintensity: 0.0315 0.3326 0.6400 2.2257 0.7248 1.0310 0.8783 0.1957 3.5377 1.1008 0.0630 1.1232 1.0280 0.9910 9.4055 1.4135 4.3861 16.3100 10.9266 1.5334 1.6485 2.4669 7.3395 1.6414 1.3089 2.3959 0.4054 6.5622 2.0264 2.1606 3.5555 3.2640 3.7185 7.6163 13.9009 30.7780 9.4061 8.6071 11.8896 7.3207 13.1343 0.2302 2.6159 25.5459 2.3716 6.4144 14.9988 29.5933 51.4184 35.1707 42.6815 1.1891 2.9124 27.3423 26.4801 7.0718 27.7571 15.4935 2.1138 14.4831 5.2104 1.4669 109.1094 95.7805 6.3274 130.9739 111.5473 68.5029 10.0676 42.3137 14.9027 28.2000 34.4879 16.1778 11.0644 3.0647 7.2976 51.9724 1.3684 1.1057 1.1945 122.8650 39.9764 61.8477 43.1632 29.7870 46.7885 27.1943 256.6052 46.6398 11.5435 1.9866 8.8412 10.7989 20.3285 42.2957 1.1627 103.6692 0.8522 4.6170 146.4549 103.4662 6.9038 16.3260 27.3981 8.1679 9.4503 60.9611 135.7147 20.2876 50.7961 236.4613 411.4002 11.0808 42.0435 42.3147 47.5728 28.0837 16.7290 58.7096 5.9448 13.2992 33.6429 10.4508 32.5310 17.5622 10.3136 24.1227 15.7549 10.4781 10.1608 15.0284 10.0362 0.4802 5.0349
temp: 298.150 k
press: 1.00000 atm
elementType: 9 9 9 8 8 7 7 7 6 6 6 6 6 6 6 6 6 6 6 6 6 6 6 6 6 6 6 1 1 1 1 1 1 1 1 1 1 1 1 1 1 1 1 1 1 1 1
symmnumber: 1
zpe: 956017.8 jmol-1
zpe.correction: 0.364128 hartree
zpe.thermalcorrener: 0.388461 hartree
zpe.thermalcorrenthalpy: 0.389405 hartree
zpe.thermalcorrgfe: 0.305429 hartree
zpe.sumelectzpe: -1348.258463 hartree
zpe.sumelectthermal: -1348.234130 hartree
zpe.sumelectthermalent: -1348.233186 hartree
zpe.sumelectthermalfe: -1348.317162 hartree
dipole: -4.7628 -3.6483 -2.4631
dipole: 6.4855
quadrupole: -182.8435 -168.4701 -159.7434
quadrupole: -5.0408 -2.6027 8.3461
quadrupole: -12.4912 1.8822 10.6089 -5.0408 -2.6027 8.3461
hfenergy: -1348.6225905 hartree
pointgroup: C01 [X(C19H20F3N3O2)]
dipole: -1.878501 -1.4109083 -0.9955493 debye
polarizability: 285.4856572|-20.7803779|266.1156812|-17.4842486|9.4335524|169.2858412 unknown
InChI: InChI=1S/C19H20F3N3O2/c20-19(21,22)15-2-1-3-17(14-15)25(16-4-7-23-8-5-16)9-6-18(26)24-10-12-27-13-11-24/h1-5,7-8,14H,6,9-13H2
charge 0 multiplicity 1
47 atoms
F  6.303608 -1.73542 0.274925
F  5.923915 -0.001579 -1.130322
F  5.557636 0.249521 1.090318
O  -6.95261 -0.210523 -0.898439
O  -3.110861 -1.411017 1.936041
N  -4.346003 -1.032858 0.00242
N  0.504168 0.170173 0.396238
N  0.525605 4.452391 -0.070191
C  -4.536959 -0.548179 -1.380989
C  -5.56574 -1.6248 0.602798
C  -1.92849 -0.387517 0.05178
C  -0.700211 -0.470398 0.987272
C  -3.168192 -0.981112 0.737403
C  -5.739174 0.422453 -1.432568
C  -6.734688 -0.628508 0.500711
C  1.587671 -0.666474 -0.011605
C  0.53507 1.580117 0.258374
C  2.935334 -0.270796 0.204075
C  1.33911 -1.944728 -0.58533
C  3.991138 -1.127891 -0.165716
C  1.387344 2.23311 -0.682609
C  -0.334544 2.421403 1.014954
C  2.40617 -2.799134 -0.931508
C  3.743851 -2.399159 -0.736563
C  5.409175 -0.667505 0.022969
C  1.345305 3.634872 -0.802508
C  -0.293717 3.817462 0.819846
H  -4.743152 -1.41248 -2.044888
H  -3.630878 -0.03991 -1.74607
H  -5.337479 -1.876029 1.651968
H  -5.822589 -2.554143 0.056336
H  -2.112028 0.670348 -0.219543
H  -1.71636 -0.920167 -0.895781
H  -0.942206 -0.010772 1.96028
H  -0.464334 -1.520318 1.215606
H  -5.979939 0.694026 -2.473439
H  -5.503168 1.342056 -0.853459
H  -6.531278 0.263212 1.131535
H  -7.681353 -1.09534 0.816795
H  3.154211 0.685156 0.687654
H  0.310613 -2.270431 -0.769932
H  2.057623 1.661926 -1.32987
H  -1.021842 2.016093 1.761641
H  2.191061 -3.779497 -1.368553
H  4.574208 -3.05742 -1.006166
H  1.994523 4.13885 -1.527611
H  -0.950245 4.46774 1.40992
