program: Gaussian 09
title: 000216280
version: EM64L-G09RevD.01
frameworkgroup: C1[X(C9H9NO6)]
method: RPBEPBE
basis: SDD
operation: Freq
keyword: #pfreq=noraman
keyword: PBEPBE/SDD
title: #p freq=noraman PBEPBE/SDD
converged: YES YES NO NO
title: Mulliken charges:
elementType: O O O O O O N C C C C C C C C C H H H H H H H H H
charge: -0.432505 -0.445351 -0.297956 -0.404755 -0.173620 -0.233283 0.024534 -0.187896 -0.154837 0.211640 0.175082 0.171798 -0.307256 -0.148697 -0.171407 -0.329885 0.289080 0.277385 0.372980 0.374313 0.260190 0.246104 0.237660 0.251830 0.394851
chargesum: 0.00000
title: Mulliken charges with hydrogens summed into heavy atoms:
elementType: O O O O O O N C C C C C C C C C
charge: -0.059526 -0.071038 -0.297956 -0.009904 -0.173620 -0.233283 0.024534 0.101184 0.122547 0.211640 0.175082 0.171798 -0.047066 0.097407 0.066253 -0.078055
polarizability: 1.68604493e+02 1.45067790e-01 1.15580228e+02 5.90001812e+00 3.06527697e+00 7.86546833e+01
1716.lowfreq: -5.9035 -2.3607 -0.0009 -0.0008 -0.0007 4.5272 13.7761 24.2841 35.4660
frequency: 13.4004 24.1174 35.4096 53.7923 73.9762 85.7538 125.1335 153.6773 164.9003 220.9445 235.0193 279.5184 327.3857 331.5373 396.3405 413.9311 426.9825 445.7910 492.9818 514.3954 549.1105 587.7623 614.4178 628.4525 636.3023 701.0607 742.6983 774.1105 789.9874 807.6690 849.7228 863.2424 892.6220 954.1675 955.9676 957.5306 997.9553 1012.6148 1029.6131 1036.1798 1080.0300 1084.9366 1107.2228 1158.6452 1185.7803 1209.1342 1236.1538 1266.7244 1287.8083 1291.5397 1310.2823 1330.0398 1373.5820 1390.6541 1414.7458 1437.3811 1568.0387 1575.1790 1650.8867 1677.9017 3030.2815 3076.7831 3144.2504 3154.2170 3174.7263 3186.4355 3471.3866 3523.1736 3523.5749
redmass: 6.0947 5.5861 6.7658 6.4684 8.7605 6.3726 6.2971 6.8176 1.8518 5.6704 5.1431 3.8884 5.2967 4.1534 5.9670 3.5448 1.3430 3.6549 3.4561 2.8269 5.6041 5.8440 4.8191 2.5575 3.4998 5.4136 2.0300 5.8254 2.4640 4.5333 5.2464 4.8083 1.3248 2.7781 5.2310 1.6741 1.3419 4.7931 3.5622 2.5496 2.5095 1.6567 3.4535 1.0931 2.9088 1.3316 1.2401 1.4975 1.5007 1.7864 1.4073 8.0081 1.2756 1.5628 2.1370 2.0145 6.0833 6.2086 9.2753 11.7364 1.0839 1.0853 1.0879 1.0913 1.0963 1.1006 1.0653 1.0644 1.0650
irintensity: 11.1137 5.2819 1.6121 19.6897 7.2380 2.0145 8.0765 3.0355 106.5585 13.2604 21.4452 36.3166 19.3306 69.2983 10.3501 4.0308 42.8815 20.9784 8.8677 28.0476 41.1512 19.7648 14.5288 72.6848 58.9395 6.1154 26.0982 9.1382 43.4384 47.9976 17.2050 13.8947 0.6443 34.7342 3.7026 7.9929 0.1645 215.0807 211.7206 115.2898 198.0490 4.9541 377.4824 5.0811 223.5510 59.5375 16.5988 31.4853 2.8801 84.6010 20.0762 4.1347 13.7879 24.6238 32.6116 83.0475 47.3340 42.6850 231.6495 176.2680 11.9351 9.0067 4.6230 10.2851 20.5727 5.4590 54.2286 54.1696 12.0354
temp: 298.150 k
press: 1.00000 atm
elementType: 8 8 8 8 8 8 7 6 6 6 6 6 6 6 6 6 1 1 1 1 1 1 1 1 1
symmnumber: 1
zpe: 461266.1 jmol-1
zpe.correction: 0.175687 hartree
zpe.thermalcorrener: 0.191305 hartree
zpe.thermalcorrenthalpy: 0.192250 hartree
zpe.thermalcorrgfe: 0.129203 hartree
zpe.sumelectzpe: -853.246690 hartree
zpe.sumelectthermal: -853.231071 hartree
zpe.sumelectthermalent: -853.230127 hartree
zpe.sumelectthermalfe: -853.293174 hartree
dipole: -2.8033 3.3406 -1.9280
dipole: 4.7681
quadrupole: -66.9469 -87.0436 -96.7248
quadrupole: 3.6517 -1.6926 -1.0705
quadrupole: 16.6249 -3.4719 -13.1530 3.6517 -1.6926 -1.0705
hfenergy: -853.4223766 hartree
pointgroup: C01 [X(C9H9N1O6)]
dipole: -1.0927599 1.4970321 -0.2896427 debye
dipolederiv: -0.5901761 0.1793154 -0.0718137 0.185274 -0.3133762 0.1699957 0.051032 0.1387465 -0.7244088 -0.2969726 -0.0173449 0.0384986 0.1570319 -0.6531734 -0.1396447 0.1304361 -0.0724627 -0.5763594 -2.1611397 0.31559 -0.4900632 0.4504481 -0.5715445 0.25213 -0.4719483 0.2100454 -0.4446419 -0.3379219 -0.2022797 -0.0098141 -0.2105288 -1.2133428 -0.0420225 -0.0163398 -0.0609672 -0.397846 -0.6683931 -0.1263693 0.1281145 0.2487771 -0.6317703 0.4280474 -0.20524 0.2800709 -0.5097811 -0.9340207 0.250137 0.2261278 0.0424326 -0.7533235 -0.1004252 0.0940697 -0.1207716 -0.3300301 -0.5851198 0.0231486 -0.0468299 -0.3039309 -0.2801515 -0.1623686 -0.2080443 -0.0964735 -0.2839649 0.0368267 -0.1086456 0.1691937 -0.2707554 0.2359858 -0.0801294 0.1245446 -0.1575969 0.4757228 -0.2279933 -0.1716619 0.1248116 -0.1657344 0.4774451 0.1054586 -0.1079381 0.1263217 0.2807387 1.8040685 -0.1170396 0.0454833 -0.7400093 0.9596932 -0.7748849 0.599259 -0.5042699 0.6264091 1.3124023 -0.0453949 -0.3449629 0.1398875 1.440442 0.1142213 -0.0950111 0.1878619 0.2369925 1.7818386 -0.0757262 0.3603061 0.2265212 0.1844198 0.1982505 0.183709 0.0799437 0.2448655 -0.516022 0.0248494 -0.0919816 0.1415839 -0.030927 0.0543347 0.0436605 0.0656364 -0.0667879 0.2134039 -0.037451 0.0033203 0.0099144 0.0726943 0.1407619 0.0206349 0.1250057 -0.019919 0.0004837 0.1104527 0.0819066 -0.0367367 -0.2055876 -0.0816151 -0.0201143 -0.0522403 -0.1683813 0.1821545 -0.0390858 -0.036717 0.1467235 0.2419843 0.2338932 0.1309576 0.2011852 0.0861571 0.0933956 0.012585 -0.0120103 0.0486937 -0.0342836 0.0047133 -0.0296489 -0.0204272 0.0662407 0.0821047 0.0588767 -0.0464113 0.0251603 -0.0279105 0.0312709 -0.0730339 0.052243 0.0092307 0.4052218 -0.1291647 -0.0035881 -0.0972624 0.1674787 -0.0370631 -0.0693344 -0.0742784 0.3623962 0.219296 0.1200631 -0.00169 -0.0019129 0.3798887 0.0139022 -0.0414663 0.0001721 0.3353346 0.1069824 -0.0412609 -0.0237674 -0.0477259 0.0422156 -0.0975637 -0.0306712 -0.0968631 0.0993997 -0.0102572 0.0810567 0.036766 0.0826435 0.0481966 -0.0636855 0.0445777 -0.0627339 0.1115089 -0.0864222 -0.0384916 -0.0479462 -0.0304486 0.1127169 -0.0409784 -0.0398668 -0.0387917 0.1388583 0.053529 -0.0246452 -0.0296236 -0.0648846 0.0009102 -0.1027147 -0.0544451 -0.0965409 0.0615201 0.1227308 -0.0015134 0.042691 0.0648383 0.3513195 -0.0238842 0.0402214 -0.012815 0.3867457 unknown
polarizability: 168.8698408|-1.9836588|110.6054639|2.5726089|13.0385276|83.3640998 unknown
InChI: InChI=1S/C9H9NO6/c11-6(8(13)14)7(12)9(15)16-5-3-1-2-4-10-5/h1-4,6-7,11-13H
charge 0 multiplicity 1
25 atoms
O  2.495672 -0.529162 1.733865
O  2.101049 -1.510987 -0.974758
O  -0.603467 0.706942 0.237684
O  3.712045 1.771958 -0.678503
O  -0.199343 -1.226808 1.524383
O  4.568215 -0.346558 -1.131934
N  -2.278349 -0.652734 -0.736485
C  1.680159 0.179817 0.773942
C  2.168412 -0.092418 -0.690789
C  0.210651 -0.234001 0.904874
C  3.603765 0.402823 -0.860542
C  -1.989497 0.414648 0.028878
C  -2.934851 1.306428 0.575301
C  -4.295188 1.046916 0.29716
C  -4.636463 -0.075022 -0.495722
C  -3.597491 -0.89581 -0.989408
H  1.779212 1.257196 0.98436
H  1.511958 0.457869 -1.390274
H  2.152374 -1.459987 1.79959
H  3.033116 -1.851341 -1.070579
H  -2.612039 2.15314 1.185889
H  -5.072413 1.706681 0.695634
H  -5.679244 -0.309284 -0.728477
H  -3.809823 -1.772917 -1.609636
H  4.66004 2.060313 -0.769556
