program: Gaussian 09
title: 000210936
version: EM64L-G09RevD.01
frameworkgroup: C1[X(C22H28F3N3O)]
method: RPBEPBE
basis: SDD
operation: Freq
keyword: #p
keyword: freq=noraman
keyword: PBEPBE/SDD
title: #p freq=noraman PBEPBE/SDD
converged: YES YES NO NO
title: Mulliken charges:
elementType: F F F O N N N C C C C C C C C C C C C C C C C C C C C C C H H H H H H H H H H H H H H H H H H H H H H H H H H H H
charge: -0.165482 -0.165230 -0.165636 -0.272826 -0.113968 -0.248317 -0.011790 -0.051978 -0.390143 -0.458690 -0.034151 -0.331903 -0.471170 -0.295713 -0.483977 -0.728587 -0.634442 0.415050 0.425145 -0.510927 -0.365456 -0.316924 -0.320382 0.322355 -0.211112 -0.377365 -0.334616 -0.351600 0.246426 0.225906 0.213561 0.213216 0.216679 0.242640 0.226366 0.212369 0.187227 0.219614 0.230092 0.193203 0.221830 0.220749 0.236144 0.251019 0.199167 0.209493 0.223160 0.201838 0.227103 0.301257 0.247937 0.261150 0.235856 0.236738 0.266829 0.242805 0.239464
chargesum: 0.00000
title: Mulliken charges with hydrogens summed into heavy atoms:
elementType: F F F O N N N C C C C C C C C C C C C C C C C C C C C C C
charge: -0.165482 -0.165230 -0.165636 -0.272826 -0.113968 -0.248317 -0.011790 0.173927 0.036634 0.000629 0.192214 0.067692 -0.021463 0.119319 -0.027085 -0.068908 0.017659 0.415050 0.425145 -0.209670 -0.117519 -0.055774 -0.084527 0.322355 0.025626 -0.110535 -0.091811 -0.112136 0.246426
polarizability: 2.89453234e+02 -2.31391663e+01 2.86998545e+02 -1.07198759e+01 -4.01472868e+01 2.29929907e+02
1716.lowfreq: -36.0792 -6.1923 -0.0010 -0.0003 0.0005 1.7297 2.7254 10.6290 14.2249
frequency: -35.1482 10.4355 14.1856 19.8892 27.9870 34.8789 42.3808 58.4376 59.1783 67.4015 74.8247 100.4289 118.0666 135.1039 144.0874 158.0617 188.8192 208.8492 228.0133 230.5573 232.3234 233.5164 279.8128 284.3282 298.1059 312.7982 326.4579 341.7414 345.9961 363.5440 376.3905 380.5821 393.8757 414.5509 429.6878 432.3657 455.1240 478.7363 520.8489 526.7812 549.4606 583.2765 586.5269 593.6498 609.1662 643.9495 659.7139 675.1050 686.8911 695.7892 738.0826 772.5953 796.1701 803.7738 811.2909 814.0034 832.9244 849.9297 853.3494 858.8636 872.0026 892.2205 899.8513 904.5238 913.9574 916.0048 931.1368 946.2580 950.8010 959.1765 971.1101 978.5727 981.6090 982.9170 984.5080 997.2812 1015.8076 1026.4681 1028.5502 1036.4775 1055.2733 1068.7368 1078.9583 1087.4918 1102.0528 1104.5816 1109.5402 1112.7359 1122.9581 1137.4942 1151.5566 1163.7688 1176.4951 1192.7226 1198.1114 1221.4457 1225.0620 1226.1467 1237.5334 1249.9212 1276.0037 1279.2649 1284.8721 1295.6173 1297.3682 1307.8105 1311.2731 1314.8182 1319.9689 1331.4100 1337.3150 1341.1974 1352.8555 1356.9345 1368.7005 1378.3377 1387.0559 1388.0294 1411.6403 1434.6388 1446.5721 1454.3269 1461.7775 1466.7339 1469.2020 1470.5721 1473.7835 1475.1358 1481.4096 1485.6613 1487.6801 1488.9499 1497.2801 1541.2341 1575.6043 1590.8182 1619.2009 2864.2489 2874.6300 2890.9960 2962.0801 2967.8675 2971.9844 2988.6626 3000.7674 3006.9201 3009.7596 3016.9854 3033.5062 3040.6107 3058.4652 3064.9873 3073.5536 3075.2396 3089.1776 3089.4984 3091.4813 3129.8121 3134.9817 3143.9380 3165.4211 3166.4996 3168.9329 3171.1792 3180.5225
redmass: 3.4072 7.7867 16.6605 4.9830 4.5709 3.2400 4.8556 5.4956 3.0812 4.1848 4.0072 3.2894 3.9036 5.5936 7.1548 2.2559 2.3790 1.4895 2.5526 1.9134 3.1072 1.8110 3.8307 3.7994 5.5745 6.3790 4.1513 5.8977 3.7378 3.1384 2.6482 2.7274 2.2886 1.9938 5.0803 4.3747 2.3993 4.7291 6.0213 4.4810 3.3149 2.0160 5.0920 5.0620 10.8500 6.4858 6.8754 4.9651 5.6321 2.3905 3.5294 4.7275 1.5803 3.2018 2.0776 1.6807 2.5357 2.3424 1.3860 2.2347 2.5957 1.8974 1.4202 1.4652 2.4518 1.4695 1.9577 1.8043 1.3910 5.7476 1.4560 1.3886 4.7742 1.8634 6.6149 2.0514 6.2672 3.3426 2.1542 5.6394 2.1378 1.6245 2.3262 1.8735 1.7165 1.7458 1.7482 1.7206 2.0178 1.2820 2.2806 1.7768 1.8732 1.1126 1.5211 2.2132 1.4692 1.4816 1.6464 1.3870 1.3955 2.0170 1.4968 1.5166 3.0764 1.2549 1.2882 1.8659 1.3460 1.3608 1.4474 1.3513 1.5044 1.4482 1.8178 1.3065 6.1897 1.3023 2.3287 1.1538 3.6001 1.0826 1.0856 1.0777 2.0315 1.1011 1.0583 1.0749 1.0562 1.4686 1.5019 1.1185 1.0804 7.0359 5.5980 5.9772 6.2951 1.0672 1.0576 1.0678 1.0673 1.0448 1.0625 1.0834 1.0763 1.0891 1.0608 1.0739 1.0906 1.0737 1.0979 1.0970 1.0920 1.1014 1.1018 1.1015 1.1005 1.0886 1.0901 1.0871 1.0928 1.0937 1.0936 1.0948 1.0980
irintensity: 1.0900 0.1993 0.1555 0.6279 0.5428 0.5505 0.2416 0.1607 1.9324 0.4487 2.8981 0.4644 1.4526 0.8514 1.6281 0.8927 2.1930 0.5720 3.2654 0.7211 0.4488 2.6873 0.0573 2.4985 2.6219 2.3779 2.1190 3.5062 3.0310 0.7365 7.6583 1.3234 1.8507 0.2314 0.6606 7.5068 3.2107 2.7380 4.9615 10.9883 5.8280 5.0050 4.8108 17.6374 11.2257 9.4838 0.2416 5.0704 7.8580 23.8050 4.6968 13.9373 66.7692 18.2384 9.6026 41.1684 24.2521 3.9973 3.8099 6.9849 55.6561 3.3714 3.4921 8.4747 9.8896 26.0347 32.5359 4.1489 0.8228 11.5530 3.9490 1.8386 13.5781 61.6566 154.5780 32.6302 133.3212 34.9987 152.4185 116.4097 0.7944 13.2419 25.1907 12.6235 2.6656 7.8724 9.7313 6.0715 1.4635 2.0461 2.4397 1.5714 33.6619 3.2167 26.8424 20.0339 58.7472 13.0868 27.6053 6.8031 8.0299 140.0103 66.5930 39.6600 46.9822 2.1611 19.4401 25.0167 8.6087 12.0371 2.8407 22.3363 25.0072 9.1072 97.3584 22.3613 0.3619 7.4350 6.9475 8.1950 93.4024 2.5444 7.9024 2.8626 57.9424 6.3603 10.5588 5.1320 11.4792 118.2627 24.7539 0.7949 21.4360 41.3097 345.5841 13.7005 46.9739 81.0144 83.1729 106.3290 105.6241 6.2328 72.2970 0.4718 15.5279 26.6533 21.0934 17.6638 67.6812 31.0556 32.7786 34.1800 27.5031 16.6077 68.6550 6.4682 48.6989 22.5746 17.0541 10.1643 5.4128 23.6931 4.6793 0.6523 5.0136
temp: 298.150 k
press: 1.00000 atm
elementType: 9 9 9 8 7 7 7 6 6 6 6 6 6 6 6 6 6 6 6 6 6 6 6 6 6 6 6 6 6 1 1 1 1 1 1 1 1 1 1 1 1 1 1 1 1 1 1 1 1 1 1 1 1 1 1 1 1
symmnumber: 1
zpe: 1218212.6 jmol-1
zpe.correction: 0.463993 hartree
zpe.thermalcorrener: 0.491666 hartree
zpe.thermalcorrenthalpy: 0.492610 hartree
zpe.thermalcorrgfe: 0.401288 hartree
zpe.sumelectzpe: -1391.927919 hartree
zpe.sumelectthermal: -1391.900246 hartree
zpe.sumelectthermalent: -1391.899302 hartree
zpe.sumelectthermalfe: -1391.990624 hartree
dipole: -4.1135 -0.7263 6.4988
dipole: 7.7254
quadrupole: -177.6922 -186.8032 -177.8949
quadrupole: -6.1194 4.5648 -1.1762
quadrupole: 3.1046 -6.0064 2.9018 -6.1194 4.5648 -1.1762
hfenergy: -1392.391912 hartree
pointgroup: C01 [X(C22H28F3N3O1)]
dipole: 1.5250765 0.2446827 -2.6176861 debye
polarizability: 281.775349|26.35549|283.4477143|-15.2676767|43.5345924|241.1586226 unknown
InChI: InChI=1S/C22H28F3N3O/c1-17(14-27(2)16-21-7-4-12-29-21)15-28(19-8-10-26-11-9-19)20-6-3-5-18(13-20)22(23,24)25/h3,5-6,8-11,13,17,21H,4,7,12,14-16H2,1-2H3
charge 0 multiplicity 1
57 atoms
F  -3.660392 -4.310032 0.82691
F  -3.162738 -2.579442 2.211403
F  -5.142199 -2.622631 1.11237
O  6.025029 -0.21198 1.67015
N  2.716375 -0.27851 -0.176623
N  -1.417305 1.119292 -0.821503
N  -2.955038 3.894951 2.092217
C  5.102695 -0.654133 0.579839
C  3.78144 0.122876 0.778716
C  5.821084 -0.336513 -0.754864
C  0.947725 0.681902 -1.703542
C  1.645295 0.740886 -0.320061
C  6.81571 0.792108 -0.372551
C  7.237748 0.376738 1.050494
C  -0.32622 1.565222 -1.732888
C  1.909953 1.111168 -2.831968
C  2.164263 -1.619421 0.126334
C  -2.015924 -0.153393 -1.048993
C  -1.920097 2.015335 0.164454
C  -2.566668 -0.89476 0.034225
C  -2.025356 -0.748033 -2.343324
C  -3.303283 2.050845 0.507359
C  -1.074725 2.95431 0.821844
C  -3.131389 -2.165621 -0.188278
C  -2.585577 -2.026203 -2.546448
C  -3.153228 -2.74901 -1.478052
C  -3.7583 2.985588 1.4573
C  -1.631749 3.85461 1.753978
C  -3.750522 -2.903521 0.964911
H  4.942011 -1.740382 0.711168
H  3.999472 1.196952 0.628781
H  3.469398 -0.001742 1.844527
H  6.374832 -1.221853 -1.117391
H  5.092353 -0.041428 -1.528607
H  0.642089 -0.365878 -1.893216
H  0.877528 0.640684 0.487741
H  2.109517 1.741454 -0.207625
H  6.306638 1.773106 -0.355104
H  7.671836 0.859545 -1.065486
H  8.044563 -0.38519 1.018828
H  7.556352 1.216342 1.691398
H  -0.711674 1.611662 -2.772013
H  -0.068329 2.603452 -1.465261
H  2.850083 0.539686 -2.747061
H  2.155137 2.189341 -2.760313
H  1.477469 0.927693 -3.833399
H  1.401728 -1.897183 -0.621205
H  1.689364 -1.66721 1.137748
H  2.959668 -2.38212 0.084112
H  -2.531575 -0.487617 1.048395
H  -1.606021 -0.212633 -3.199551
H  -4.019466 1.379985 0.025097
H  0.002719 2.978078 0.639138
H  -2.583961 -2.457818 -3.552651
H  -3.585745 -3.74108 -1.632998
H  -4.821493 3.024803 1.720148
H  -0.987003 4.576925 2.267991
