program: Gaussian 09
title: 000216308
version: EM64L-G09RevD.01
frameworkgroup: C1[X(C14H22N2O)]
method: RPBEPBE
basis: SDD
operation: Freq
keyword: #p
keyword: freq=noraman
keyword: PBEPBE/SDD
title: #p freq=noraman PBEPBE/SDD
converged: YES YES NO NO
title: Mulliken charges:
elementType: O N N C C C C C C C C C C C C C C H H H H H H H H H H H H H H H H H H H H H H
charge: -0.243279 -0.472189 -0.152472 0.211176 0.163145 0.145205 0.398193 0.390725 -0.722411 -0.829979 -0.854673 -0.849801 -0.852125 -0.465431 0.144338 -0.614161 -0.608398 0.230915 0.355056 0.283206 0.218338 0.224412 0.236694 0.249565 0.228489 0.232549 0.240085 0.229731 0.236062 0.226326 0.228813 0.233621 0.226875 0.225793 0.238291 0.207760 0.224530 0.202831 0.232195
chargesum: 0.00000
title: Mulliken charges with hydrogens summed into heavy atoms:
elementType: O N N C C C C C C C C C C C C C C
charge: -0.243279 -0.117132 -0.152472 0.211176 0.163145 0.145205 0.398193 0.390725 -0.491496 -0.104024 -0.139925 -0.157682 -0.162816 0.007204 0.144338 0.057683 0.051158
polarizability: 2.21053273e+02 1.41373950e+00 1.87836976e+02 -1.55101176e+00 -9.74524800e-01 1.13658665e+02
1716.lowfreq: -9.9413 -8.1674 0.0005 0.0005 0.0008 2.0685 29.9143 51.1213 70.5797
frequency: 29.5398 51.0880 70.4246 83.2599 99.2614 112.6295 119.9750 129.3738 157.7879 159.5706 173.4784 191.2624 208.9451 227.7491 242.9609 273.8182 308.4014 311.0630 331.1074 342.9456 345.4131 350.2150 362.1728 383.9729 436.8637 472.2518 488.3640 532.9707 548.7402 562.9462 583.8723 609.7112 671.9476 716.5341 763.8528 814.8749 823.4709 836.6673 878.4289 911.4563 942.6029 972.1365 994.9085 1018.0635 1022.4967 1029.2435 1033.7971 1034.3906 1048.5389 1051.0096 1057.4242 1083.3595 1090.2295 1100.5002 1135.3800 1155.2256 1201.0736 1235.4866 1251.7491 1263.4031 1272.1429 1319.7809 1325.7458 1361.9100 1391.4109 1393.3318 1399.3612 1402.0589 1404.5972 1420.7713 1432.3707 1447.1248 1453.9312 1458.3751 1460.8189 1465.4308 1466.2196 1471.9290 1474.7103 1476.2533 1480.8677 1486.4216 1486.9248 1488.5031 1492.0772 1505.6167 1586.2812 1615.7730 1634.7426 2892.0056 2901.0419 2950.5081 2961.9844 2968.6607 2969.7605 2981.9034 3029.2815 3032.6691 3035.4900 3041.8774 3043.5945 3046.3726 3061.8594 3079.1687 3079.5419 3084.4333 3089.2422 3089.7409 3102.2762 3114.7958 3316.2742
redmass: 3.5906 3.5488 2.5735 2.9193 3.0583 1.1226 3.3492 3.6752 1.7239 1.1281 1.1049 1.3746 3.8517 1.2193 1.0469 2.4722 3.0944 3.0489 3.1018 2.9563 2.8532 2.9789 2.7928 2.0028 4.7690 4.0363 4.1561 4.4605 3.5355 3.2219 3.3214 3.7226 3.9527 3.8224 4.0445 1.7640 2.6145 2.1557 1.3163 2.9299 2.7438 1.9735 1.3300 1.5223 1.4303 1.5053 1.8813 1.7208 2.0376 1.7049 1.7412 2.6242 1.2814 2.5814 1.4559 1.7071 2.6450 4.2687 1.3798 2.4358 1.6487 4.9567 1.4865 5.7235 1.2543 1.2598 1.2110 1.4882 2.2737 1.1408 1.2295 1.3783 1.2786 1.1186 1.1017 1.0895 1.0622 1.2435 1.0785 1.0767 1.2349 1.0976 1.0593 1.0581 1.1106 1.9999 5.7872 6.6072 7.8848 1.0525 1.0522 1.0644 1.0450 1.0379 1.0382 1.0368 1.0781 1.0798 1.0947 1.0905 1.0965 1.0959 1.0969 1.0982 1.0987 1.1014 1.1014 1.0986 1.0957 1.0909 1.0755
irintensity: 0.8114 1.1367 0.7835 2.6227 1.4584 0.1573 1.4425 2.4196 7.0712 0.7031 0.3283 1.8305 2.1585 1.0163 0.4011 1.9508 0.9928 3.9363 0.3353 0.7114 0.9558 2.1352 1.9666 7.4005 0.2323 10.7735 13.6492 16.5348 4.0674 0.0568 0.0758 4.5993 2.8530 1.8648 0.4079 17.8717 63.8174 14.9638 10.3824 1.2407 27.9994 12.2515 5.4270 16.2296 2.3187 12.3405 19.8535 33.8327 5.9331 0.1202 0.6500 0.5312 8.0581 13.8142 9.4383 4.9590 10.6739 0.8318 0.2802 10.9766 7.0466 0.6535 2.8434 14.7255 0.5514 12.0516 21.6955 7.2989 7.6913 4.0153 74.1541 52.8188 26.5701 0.5553 13.5153 15.8244 14.4469 80.8177 7.3743 45.4233 146.0244 11.2346 10.8156 4.6874 35.2739 158.8723 12.3036 7.0265 199.8326 78.7077 172.5431 56.9577 38.7221 54.6400 26.3901 25.3586 26.9878 39.1383 13.5499 33.1501 9.4686 24.2959 11.6936 3.3385 47.4473 19.0272 48.6893 12.3751 19.2228 28.5271 207.4712
temp: 298.150 k
press: 1.00000 atm
elementType: 8 7 7 6 6 6 6 6 6 6 6 6 6 6 6 6 6 1 1 1 1 1 1 1 1 1 1 1 1 1 1 1 1 1 1 1 1 1 1
symmnumber: 1
zpe: 875596.8 jmol-1
zpe.correction: 0.333497 hartree
zpe.thermalcorrener: 0.352880 hartree
zpe.thermalcorrenthalpy: 0.353824 hartree
zpe.thermalcorrgfe: 0.286402 hartree
zpe.sumelectzpe: -730.118877 hartree
zpe.sumelectthermal: -730.099494 hartree
zpe.sumelectthermalent: -730.098550 hartree
zpe.sumelectthermalfe: -730.165972 hartree
dipole: -2.3612 2.5586 -2.5831
dipole: 4.3352
quadrupole: -85.0503 -100.6948 -110.3386
quadrupole: -3.0661 3.5258 6.4230
quadrupole: 13.6443 -2.0002 -11.6441 -3.0661 3.5258 6.4230
hfenergy: -730.4523742 hartree
pointgroup: C01 [X(C14H22N2O1)]
dipole: 0.8156987 1.3552056 0.6380991 debye
polarizability: 220.9737019|1.7844535|179.7990749|3.7231891|-22.9747092|121.7761373 unknown
InChI: InChI=1S/C14H22N2O/c1-9-7-10(2)12(4)14(11(9)3)15-13(17)8-16(5)6/h7,15H,8H2,1-6H3
charge 0 multiplicity 1
39 atoms
O  1.402901 -2.391081 -0.76249
N  0.893163 -0.335804 0.29573
N  3.493476 0.389567 0.423286
C  -0.534684 -0.272628 0.164772
C  -1.346409 -1.346494 0.633171
C  -1.091852 0.913584 -0.402955
C  -2.758136 -1.244716 0.463885
C  -2.503689 1.015825 -0.52779
C  -3.304543 -0.073396 -0.107938
C  -0.731329 -2.547963 1.322603
C  -0.16883 2.028056 -0.870219
C  -3.688228 -2.363304 0.905236
C  -3.171618 2.248729 -1.118257
C  3.216676 -1.055378 0.226402
C  1.741056 -1.33445 -0.152328
C  3.774968 1.07952 -0.858593
C  4.526011 0.670152 1.446595
H  -4.393488 -0.002194 -0.22379
H  1.427374 0.481314 0.642953
H  -0.382578 -3.292556 0.583383
H  0.156594 -2.251855 1.909977
H  -1.44786 -3.034719 2.004594
H  0.658132 1.625542 -1.483494
H  -0.705395 2.775714 -1.474491
H  0.293099 2.569617 -0.019235
H  3.8528 -1.526048 -0.55437
H  3.414076 -1.592078 1.17389
H  -4.729955 -2.144275 0.614631
H  -3.406402 -3.332226 0.452956
H  -3.671755 -2.504515 2.003648
H  -2.881301 2.411543 -2.174354
H  -4.269859 2.146408 -1.090826
H  -2.907727 3.16899 -0.56356
H  3.815759 2.170963 -0.695087
H  2.967902 0.867278 -1.5810
H  4.740209 0.755584 -1.315722
H  4.602093 1.761137 1.60262
H  5.538008 0.291987 1.165357
H  4.23674 0.207072 2.406013
