program: Gaussian 09
title: 000216312
version: EM64L-G09RevD.01
frameworkgroup: C1[X(C16H24N2O2)]
method: RPBEPBE
basis: SDD
operation: Freq
keyword: #p
keyword: freq=noraman
keyword: PBEPBE/SDD
title: #p freq=noraman PBEPBE/SDD
converged: NO YES NO NO
title: Mulliken charges:
elementType: O O N N C C C C C C C C C C C C C C C C H H H H H H H H H H H H H H H H H H H H H H H H
charge: -0.242764 -0.240174 -0.162141 -0.470755 -0.344738 -0.343700 -0.455094 -0.320072 -0.315999 0.207655 0.137534 0.164935 0.152304 0.397504 0.389068 -0.722005 -0.831423 -0.860415 -0.849505 -0.851578 0.221630 0.217595 0.205421 0.217403 0.232868 0.236086 0.223179 0.193706 0.191103 0.220644 0.345530 0.231638 0.226181 0.217500 0.283931 0.235381 0.224256 0.252692 0.230346 0.236522 0.226832 0.227371 0.229035 0.234511
chargesum: 0.00000
title: Mulliken charges with hydrogens summed into heavy atoms:
elementType: O O N N C C C C C C C C C C C C C C C C
charge: -0.242764 -0.240174 -0.162141 -0.125225 0.094487 0.079124 0.013860 0.096813 0.095749 0.207655 0.137534 0.164935 0.152304 0.397504 0.389068 -0.490367 -0.103811 -0.148087 -0.155804 -0.160660
polarizability: 2.44418813e+02 4.35207857e+00 2.09607106e+02 -5.39085388e+00 3.93505991e+00 1.35868022e+02
1716.lowfreq: -27.9020 -13.3079 -8.1646 -0.0004 -0.0002 0.0006 16.2285 33.2483 46.0824
frequency: -7.4074 32.0827 45.8536 67.4472 85.7917 94.3950 102.7557 118.9609 148.6057 160.2262 167.0974 175.7134 192.4701 208.8574 240.1064 263.8650 300.0809 308.9578 317.2791 331.2464 333.8123 339.1226 349.1316 357.4123 395.8714 437.6241 465.3531 472.3998 493.0173 526.4424 547.7053 558.2590 585.4333 602.5536 622.5166 672.0142 713.7677 761.7737 779.3771 801.1077 808.0617 827.7740 839.4230 879.0216 886.2461 911.4376 943.7117 976.4829 995.1444 1001.7085 1018.1652 1024.3505 1025.7482 1030.1105 1047.9026 1050.6983 1052.6239 1058.9281 1081.7092 1083.7233 1096.2465 1108.7379 1126.9079 1134.2135 1190.2579 1196.5928 1217.0729 1235.3390 1253.1249 1265.9440 1276.6665 1293.8539 1313.0929 1319.7996 1336.1928 1353.1415 1361.4703 1369.6748 1374.4431 1391.9059 1394.3657 1400.7070 1402.8746 1405.3116 1442.3322 1443.4165 1445.7405 1451.0087 1454.3816 1456.0499 1460.5965 1461.4158 1465.7095 1475.8424 1477.2701 1485.0162 1487.6314 1492.0693 1505.0541 1585.7877 1616.1345 1634.8091 2898.3870 2904.5496 2947.3354 2952.3639 2954.7710 2959.0605 2969.6028 2970.6871 2981.4532 3031.0123 3034.9679 3035.8750 3039.3344 3044.3099 3047.1487 3060.2343 3079.5712 3080.0002 3084.8310 3087.8255 3091.0755 3101.8155 3116.7787 3332.2614
redmass: 3.9142 3.3992 4.1300 3.3477 3.4635 4.1334 1.1781 3.0166 3.3684 1.8871 1.1087 1.0741 1.4365 3.3397 1.8270 2.9715 2.9157 3.9456 2.8759 3.0303 2.6592 2.9772 3.6115 2.9218 1.9616 4.9283 2.8575 5.0648 4.6601 4.2188 3.4348 3.3460 3.3278 3.0323 2.3126 3.9584 3.8563 3.8317 4.2801 1.2249 3.5485 2.7402 1.6070 1.3186 2.4137 3.0746 2.6604 2.0628 1.3304 2.5879 1.5270 1.4432 2.1475 1.5094 2.1040 1.9896 1.6384 1.7275 3.6741 2.8515 2.4622 2.4756 2.7372 2.4388 1.1255 2.1915 1.2561 4.3135 1.3818 1.2923 1.3521 1.2625 1.4534 4.9246 1.2262 1.3538 5.8738 1.2679 1.4655 1.2516 1.2517 1.2176 1.8830 1.7376 1.2036 1.0888 1.3015 1.0985 1.0842 1.2520 1.1450 1.1277 1.0613 1.0822 1.4990 1.0678 1.0768 1.1084 2.1098 5.7726 6.5860 7.9339 1.0694 1.0684 1.0671 1.0670 1.0630 1.0449 1.0379 1.0380 1.0370 1.0961 1.0920 1.0920 1.0923 1.0974 1.0961 1.0968 1.0981 1.0988 1.0950 1.0969 1.0982 1.0947 1.0909 1.0755
irintensity: 0.3039 0.3872 0.5087 3.2305 2.2757 2.6047 0.0385 1.4756 7.9198 3.8642 1.5426 0.0754 1.8197 1.2911 1.8761 6.5933 5.1124 1.4417 5.0450 0.3604 1.3813 1.3324 0.1553 0.8403 0.8036 0.1472 5.0115 16.2303 12.0743 10.1912 4.5743 1.0791 0.0843 3.4976 6.2635 2.1785 4.1063 0.3962 5.3601 48.3284 43.8144 9.0417 0.8151 9.2970 22.3793 1.0953 21.1137 2.6364 4.8549 25.6763 14.5425 2.3498 13.6981 13.4854 5.8804 21.9529 0.0781 0.5347 42.4100 11.2052 9.3016 8.2515 20.9093 22.2648 1.8495 16.3281 7.2169 1.3823 0.2056 12.8242 16.4644 2.7156 12.1557 1.3090 3.2714 1.7207 13.9635 6.1880 15.4659 1.7576 10.0199 18.9604 7.4046 6.9069 56.2280 3.7155 41.8276 20.2886 16.2801 11.8697 21.2308 6.3630 23.4100 7.7788 244.6240 3.7771 0.4929 38.5757 138.0688 11.3424 7.0892 206.6680 46.4895 101.6541 34.9703 70.4664 86.7054 44.3811 52.4882 27.0005 24.6071 2.4738 4.4552 66.5051 32.7721 18.9119 23.8096 11.9334 5.5720 45.4738 34.8314 39.7176 19.4978 19.1546 28.0366 218.0198
temp: 298.150 k
press: 1.00000 atm
elementType: 8 8 7 7 6 6 6 6 6 6 6 6 6 6 6 6 6 6 6 6 1 1 1 1 1 1 1 1 1 1 1 1 1 1 1 1 1 1 1 1 1 1 1 1
symmnumber: 1
zpe: 982031.9 jmol-1
zpe.correction: 0.374036 hartree
zpe.thermalcorrener: 0.394080 hartree
zpe.thermalcorrenthalpy: 0.395024 hartree
zpe.thermalcorrgfe: 0.326087 hartree
zpe.sumelectzpe: -882.520316 hartree
zpe.sumelectthermal: -882.500272 hartree
zpe.sumelectthermalent: -882.499328 hartree
zpe.sumelectthermalfe: -882.568265 hartree
dipole: -1.1536 1.2772 -2.2412
dipole: 2.8258
quadrupole: -119.7981 -119.6191 -124.0730
quadrupole: 9.5509 -2.1129 9.9038
quadrupole: 1.3653 1.5443 -2.9096 9.5509 -2.1129 9.9038
hfenergy: -882.8943524 hartree
pointgroup: C01 [X(C16H24N2O2)]
dipole: 0.272862 1.0017887 0.397429 debye
polarizability: 244.7227446|5.4099147|179.1842708|3.5930152|-36.2667183|165.9869263 unknown
InChI: InChI=1S/C16H24N2O2/c1-11-9-12(2)14(4)16(13(11)3)17-15(19)10-18-5-7-20-8-6-18/h9,17H,5-8,10H2,1-4H3
charge 0 multiplicity 1
44 atoms
O  4.549535 2.094574 -0.396794
O  0.436321 -2.888438 0.102153
N  2.810678 -0.094658 0.382946
N  0.143076 -0.560495 0.402927
C  3.19467 0.119118 -1.04218
C  3.885423 0.396058 1.290093
C  2.383069 -1.490068 0.645939
C  3.485739 1.607648 -1.289624
C  4.160237 1.882413 1.007014
C  -1.271839 -0.411965 0.207686
C  0.884013 -1.728003 0.33734
C  -2.186629 -1.178772 0.985985
C  -1.706022 0.551363 -0.752653
C  -3.580857 -1.011429 0.740709
C  -3.100362 0.732169 -0.959146
C  -4.006263 -0.0659 -0.219872
C  -1.693265 -2.122464 2.06429
C  -0.674842 1.346425 -1.538357
C  -4.618549 -1.817415 1.505103
C  -3.641355 1.737916 -1.964406
H  2.365401 -0.216292 -1.692454
H  4.098539 -0.482012 -1.302418
H  4.830016 -0.182558 1.152552
H  3.554243 0.273713 2.338428
H  2.961091 -2.244654 0.070633
H  2.53296 -1.71658 1.719239
H  3.859316 1.774605 -2.312957
H  2.560192 2.20364 -1.131063
H  3.251768 2.480286 1.238834
H  5.008037 2.250834 1.607319
H  0.752319 0.272282 0.482816
H  -5.082254 0.059796 -0.394688
H  -2.457494 -2.285631 2.841883
H  -0.78584 -1.721865 2.551667
H  -1.410818 -3.100932 1.633564
H  0.095243 0.679326 -1.968679
H  -0.146684 2.085517 -0.901236
H  -1.136056 1.907297 -2.365833
H  -5.632763 -1.616181 1.119902
H  -4.433962 -2.904527 1.422729
H  -4.618086 -1.571873 2.585027
H  -3.303056 2.76815 -1.743978
H  -3.319808 1.50414 -2.997721
H  -4.744579 1.741141 -1.955821
