program: Gaussian 09
title: 000216310
version: EM64L-G09RevD.01
frameworkgroup: C1[X(C16H24N2O)]
method: RPBEPBE
basis: SDD
operation: Freq
keyword: #p
keyword: freq=noraman
keyword: PBEPBE/SDD
title: #p freq=noraman PBEPBE/SDD
converged: NO YES NO NO
title: Mulliken charges:
elementType: O N N C C C C C C C C C C C C C C C C H H H H H H H H H H H H H H H H H H H H H H H H
charge: -0.245623 -0.148471 -0.476074 -0.417021 -0.435481 -0.434774 -0.444192 -0.452581 0.137839 0.211674 0.142305 0.163613 0.395263 0.397372 -0.723682 -0.857913 -0.832848 -0.850559 -0.850670 0.232418 0.232476 0.216945 0.238601 0.232404 0.223224 0.222655 0.231126 0.236671 0.233311 0.363570 0.230705 0.230698 0.243967 0.245361 0.284165 0.224830 0.219086 0.233174 0.228195 0.226748 0.229349 0.226219 0.235924
chargesum: 0.00000
title: Mulliken charges with hydrogens summed into heavy atoms:
elementType: O N N C C C C C C C C C C C C C C C C
charge: -0.245623 -0.148471 -0.112504 0.047874 0.020065 0.020855 0.009589 0.017401 0.137839 0.211674 0.142305 0.163613 0.395263 0.397372 -0.492977 -0.137886 -0.104767 -0.162441 -0.159178
polarizability: 2.48719356e+02 -1.27592842e+00 2.02679743e+02 9.81679723e-01 -5.94116616e-01 1.28374192e+02
1716.lowfreq: -13.9877 -8.8521 -3.0310 -0.0001 0.0004 0.0005 18.5472 38.2129 50.8683
frequency: 18.2469 37.9740 50.8282 54.4769 70.3410 79.6525 97.1982 110.4011 120.3218 132.0948 150.0022 158.6364 176.8986 192.0553 209.6533 282.1281 308.8525 328.0948 332.0637 343.3476 348.4353 358.1268 367.5735 427.2018 441.1581 487.6920 531.3455 548.8740 553.9438 584.7416 605.5732 622.6690 662.2977 675.0906 715.9896 762.8298 781.7517 813.8452 828.9407 837.2294 851.0970 877.6387 882.8054 909.4984 917.0069 936.9356 949.7591 971.5358 994.8020 1018.2598 1022.8617 1024.9774 1029.6787 1046.4216 1052.2479 1055.1484 1056.8480 1072.0043 1083.3758 1102.3859 1109.0586 1174.8568 1188.3883 1199.9661 1220.5164 1234.9414 1246.7406 1249.1163 1259.8705 1291.9159 1301.2033 1311.0352 1316.0602 1319.6040 1328.8250 1361.9453 1391.9355 1393.7156 1400.4216 1402.6112 1404.8025 1443.2880 1448.6175 1454.3982 1461.8793 1465.9890 1467.5721 1474.0064 1475.6472 1477.2798 1478.8663 1484.1468 1484.8260 1491.0583 1491.5152 1504.4419 1585.9123 1615.6552 1632.6106 2960.1923 2960.9460 2968.2882 2969.7331 2981.1347 2993.0581 2998.9984 3007.0191 3022.4739 3036.6595 3041.8196 3043.4039 3046.2778 3059.0819 3059.9335 3074.3134 3078.5450 3079.2811 3080.2805 3090.9389 3093.8829 3096.0639 3113.0691 3305.0050
redmass: 3.0487 2.4633 2.8241 1.5856 2.2218 2.1540 3.4434 3.0855 3.3593 3.4836 1.1164 1.7707 1.0448 1.4581 3.5718 2.8593 3.4096 2.5870 3.2223 2.7789 3.1812 2.5105 2.4250 3.9451 4.8197 4.4880 4.1303 3.5767 3.0968 3.3212 3.5098 2.3086 3.4588 3.4997 3.2900 3.1017 1.9830 1.6017 2.1575 1.8677 2.1222 1.3198 3.2580 2.7218 2.6294 1.8882 2.1102 2.0877 1.3290 1.5181 1.4957 2.5199 1.5215 2.1685 1.6470 2.1578 1.7856 2.1714 2.6661 2.7745 2.0257 1.3299 1.2166 2.4637 1.2060 4.1243 1.3173 1.3730 1.3543 1.2966 1.3477 1.3240 1.3579 3.8950 1.4664 5.8504 1.2376 1.2745 1.2147 1.3964 2.5467 1.2096 1.2458 1.2786 1.1435 1.0742 1.0839 1.0965 1.0721 1.5262 1.1010 1.0709 1.0776 1.1096 1.1019 2.1729 5.8076 6.5981 8.0227 1.0453 1.0618 1.0379 1.0382 1.0369 1.0647 1.0639 1.0598 1.0642 1.0983 1.0924 1.0943 1.0960 1.1017 1.0968 1.1012 1.0980 1.0990 1.1029 1.0983 1.1059 1.0964 1.0910 1.0756
irintensity: 0.5474 1.1618 0.2417 0.4471 0.8456 1.0694 1.2166 2.0999 1.9663 2.6339 0.6795 8.1810 0.0513 2.5446 2.4763 0.2409 0.9668 0.4606 0.7816 0.7722 0.2963 0.4157 1.0887 1.8746 0.1415 24.8390 12.4797 5.0644 3.3170 0.0558 5.1826 3.9393 4.2567 10.9993 1.8654 0.5950 8.3024 31.2089 50.7763 15.2941 2.6027 10.5957 10.8854 1.8306 0.7835 40.3524 4.7392 12.8801 5.3771 18.0097 1.6861 12.2572 14.7453 8.0431 0.6114 13.2401 3.1519 32.3578 0.4166 14.3770 0.7494 5.7590 0.8808 10.8721 2.5023 1.0277 10.2818 1.0804 9.7968 3.3287 4.4751 7.4653 2.9726 2.4461 6.5550 14.2256 0.8032 11.6318 23.9713 6.7611 3.6931 97.8827 27.8478 18.6464 12.4680 13.0479 3.1499 16.0374 7.8526 265.3499 2.4173 5.1296 15.8922 19.7496 35.2772 172.5464 12.6394 6.9517 204.2393 35.6457 36.2437 51.3617 30.8637 24.9704 42.0219 32.5137 38.0139 48.8549 11.4857 41.1384 2.5250 24.0016 15.4698 12.5659 2.1944 16.0595 34.5597 15.3089 23.3367 82.2714 17.9018 30.1294 270.2380
temp: 298.150 k
press: 1.00000 atm
elementType: 8 7 7 6 6 6 6 6 6 6 6 6 6 6 6 6 6 6 6 1 1 1 1 1 1 1 1 1 1 1 1 1 1 1 1 1 1 1 1 1 1 1 1
symmnumber: 1
zpe: 970587.2 jmol-1
zpe.correction: 0.369677 hartree
zpe.thermalcorrener: 0.390085 hartree
zpe.thermalcorrenthalpy: 0.391029 hartree
zpe.thermalcorrgfe: 0.319270 hartree
zpe.sumelectzpe: -807.391547 hartree
zpe.sumelectthermal: -807.371139 hartree
zpe.sumelectthermalent: -807.370195 hartree
zpe.sumelectthermalfe: -807.441954 hartree
dipole: 3.0175 2.4278 -2.4449
dipole: 4.5801
quadrupole: -96.1058 -112.2732 -121.8457
quadrupole: 0.8468 -1.4382 6.3785
quadrupole: 13.9691 -2.1983 -11.7709 0.8468 -1.4382 6.3785
hfenergy: -807.761224 hartree
pointgroup: C01 [X(C16H24N2O1)]
dipole: 1.0301588 -1.4276984 0.3840038 debye
polarizability: 248.2714355|-5.0469255|188.1637927|-0.0529341|29.8760071|143.3380638 unknown
InChI: InChI=1S/C16H24N2O/c1-11-9-12(2)14(4)16(13(11)3)17-15(19)10-18-7-5-6-8-18/h9,17H,5-8,10H2,1-4H3
charge 0 multiplicity 1
43 atoms
O  0.786311 2.564006 -0.475616
N  2.854187 -0.352994 0.396525
N  0.2838 0.412904 0.376233
C  3.193189 -0.966374 -0.931507
C  4.011141 -0.74071 1.260798
C  4.75499 -0.888958 -1.079877
C  5.279989 -0.598437 0.364682
C  2.611749 1.11562 0.30622
C  1.128094 1.446138 0.012939
C  -1.145173 0.361771 0.257132
C  -1.70702 -0.754209 -0.434352
C  -1.952708 1.374424 0.852364
C  -3.120709 -0.84904 -0.547045
C  -3.366486 1.28466 0.696076
C  -3.918452 0.18077 0.006411
C  -0.791031 -1.8073 -1.037984
C  -1.325389 2.497041 1.65432
C  -3.790714 -2.012686 -1.261938
C  -4.293359 2.342122 1.274327
H  2.654154 -0.443584 -1.739643
H  2.862139 -2.021559 -0.92629
H  3.877813 -1.797155 1.563329
H  4.037533 -0.125631 2.175674
H  5.053992 -0.089594 -1.779693
H  5.154621 -1.838864 -1.47599
H  6.081715 -1.293034 0.669731
H  5.682871 0.428179 0.432616
H  2.864115 1.581284 1.277863
H  3.21639 1.629531 -0.469955
H  0.823543 -0.43476 0.631026
H  -5.00904 0.116163 -0.097591
H  -0.398744 -2.504604 -0.269086
H  0.082498 -1.340144 -1.52777
H  -1.314432 -2.418868 -1.790053
H  -0.966733 3.303991 0.988791
H  -2.035903 2.925112 2.380399
H  -0.440756 2.134626 2.208997
H  -4.889104 -1.925329 -1.203663
H  -3.518098 -2.051171 -2.334583
H  -3.508065 -2.987416 -0.821068
H  -5.340458 2.144641 0.98733
H  -4.250511 2.367985 2.380711
H  -4.029753 3.355657 0.919108
