program: Gaussian 09
title: 000216314
version: EM64L-G09RevD.01
frameworkgroup: C1[X(C17H26N2O)]
method: RPBEPBE
basis: SDD
operation: Freq
keyword: #p
keyword: freq=noraman
keyword: PBEPBE/SDD
title: #p freq=noraman PBEPBE/SDD
converged: NO YES NO NO
title: Mulliken charges:
elementType: O N N C C C C C C C C C C C C C C C C C H H H H H H H H H H H H H H H H H H H H H H H H H H
charge: -0.243191 -0.143352 -0.472008 -0.361161 -0.368510 -0.391543 -0.396246 -0.398630 -0.455621 0.130914 0.205744 0.163990 0.151071 0.397169 0.391210 -0.723523 -0.833655 -0.856995 -0.850733 -0.851914 0.217165 0.181514 0.196319 0.223530 0.202968 0.198413 0.201680 0.205358 0.218443 0.193197 0.236122 0.230747 0.348034 0.230783 0.225645 0.284621 0.218431 0.248969 0.224754 0.238989 0.226337 0.236251 0.229660 0.226771 0.233634 0.228650
chargesum: 0.00000
title: Mulliken charges with hydrogens summed into heavy atoms:
elementType: O N N C C C C C C C C C C C C C C C C C
charge: -0.243191 -0.143352 -0.123974 0.037519 0.051339 0.009838 0.010792 0.013010 0.011247 0.130914 0.205744 0.163990 0.151071 0.397169 0.391210 -0.492740 -0.104959 -0.144282 -0.158485 -0.162860
polarizability: 2.54836536e+02 -1.86075286e+00 2.16729971e+02 5.97929749e+00 2.22367478e+00 1.40723450e+02
1716.lowfreq: -28.8218 -20.0155 -8.3308 -0.0005 -0.0003 -0.0001 15.3215 27.2289 44.6686
frequency: -9.6388 21.2489 44.4113 66.0625 83.7660 94.7104 101.3994 118.7796 143.3763 158.6957 165.3903 175.2419 193.5986 208.8468 232.2801 256.4656 294.1015 309.2957 318.7373 329.4596 333.1753 341.1906 349.5895 357.3060 383.8762 437.6215 445.3131 468.8112 479.6209 523.6979 544.7403 554.7294 585.3032 587.2849 612.5912 671.8667 712.8401 760.4538 773.2683 797.9500 813.1635 830.6689 851.7457 854.3950 877.9689 891.8293 910.9545 944.8712 952.3274 979.6057 994.6142 995.4871 1018.2042 1024.0451 1030.1225 1047.3500 1048.8394 1052.4949 1058.9374 1078.2195 1083.3839 1098.0652 1109.9549 1117.2556 1144.6958 1155.2939 1180.9671 1198.0093 1235.4767 1252.3651 1253.9749 1262.6520 1272.1426 1291.6931 1313.8342 1319.9675 1331.2377 1337.5843 1349.7044 1359.5035 1361.0854 1377.4317 1391.8050 1394.4014 1400.4038 1402.8895 1405.2483 1444.4278 1449.2454 1450.8888 1455.5969 1458.5331 1460.8574 1464.4292 1465.3168 1467.4427 1473.9902 1476.2471 1479.9203 1485.7719 1486.4430 1492.3346 1505.1769 1585.5806 1615.5524 1634.0139 2860.3008 2868.2093 2949.5368 2959.7068 2969.0612 2969.8263 2970.3345 2980.9189 2984.2495 2984.8747 3026.6673 3031.4689 3031.7407 3039.1828 3040.2777 3043.8521 3045.6933 3046.7645 3054.9175 3059.0903 3078.6956 3079.1976 3092.6130 3101.2856 3115.7791 3312.2024
redmass: 3.5960 3.0018 3.8156 3.2037 2.5037 4.0567 1.3038 3.1895 2.8466 1.7100 1.1514 1.0875 1.4115 3.2496 1.8376 2.6153 2.6792 3.7238 2.4383 3.2847 2.7389 2.8722 3.5679 2.9190 1.8740 4.8413 2.8354 3.5828 3.1140 3.8385 3.1531 3.4212 3.3151 2.5305 3.3729 3.9516 3.8612 3.7212 3.9482 1.4621 1.4292 2.0977 2.3151 1.6014 1.3188 2.3755 3.0639 2.5847 1.3234 1.9943 2.3304 1.3824 1.5248 1.4247 1.4990 2.1161 2.1135 1.6430 1.7267 1.4825 2.7082 2.6394 2.5943 2.6096 1.3890 1.9893 1.2728 2.5558 4.3617 1.3822 1.3835 1.2418 1.3046 1.3394 1.5225 4.5713 1.3363 1.4117 1.4909 1.4066 5.8755 1.4448 1.2566 1.2521 1.2156 1.9264 1.6960 1.3723 1.1729 1.0926 1.2411 1.0924 1.1315 1.1041 1.0753 1.0861 1.2732 1.0785 1.2716 1.0926 1.0576 1.1062 2.0783 5.7416 6.5771 7.8772 1.0711 1.0698 1.0637 1.0452 1.0378 1.0632 1.0382 1.0371 1.0608 1.0623 1.0914 1.0921 1.0926 1.0940 1.0899 1.0972 1.1026 1.0961 1.1038 1.0968 1.0981 1.0989 1.0981 1.0955 1.0909 1.0757
irintensity: 0.1477 0.3892 0.5597 2.1566 0.7305 2.8408 0.0060 1.5651 3.3481 5.1697 2.4491 0.3030 2.0497 1.3145 0.8657 4.7291 1.6435 1.3679 2.9813 0.4678 0.2998 1.1381 0.3626 0.9903 1.7300 0.1997 1.6495 6.2414 21.2151 7.3808 1.5979 3.4199 0.0266 2.2495 5.0868 1.9808 5.2892 1.2245 8.4137 10.0328 36.1317 30.8336 4.6670 7.8169 10.1181 3.7065 0.9900 24.4115 6.9066 14.7612 22.0039 2.4538 15.0752 2.6835 14.0528 3.2718 10.7355 0.4563 0.6680 5.5295 0.4708 25.8782 15.3345 3.6560 4.1228 16.8569 5.6285 15.6640 1.9496 0.1729 5.2585 0.5686 14.3113 5.3867 12.6010 2.2968 1.3457 0.4664 1.0067 0.2749 13.9575 28.7250 1.8531 9.3165 18.7466 7.1130 7.1014 100.8082 17.8778 2.8481 19.7087 3.8377 20.8502 14.3044 29.0009 12.5382 91.2379 6.2192 151.9882 5.8761 4.4701 36.3426 151.7156 11.8660 6.9454 209.6075 39.2823 160.3063 50.5533 49.9008 51.2295 46.2910 23.8815 23.8446 28.2380 22.9436 20.0959 45.2009 53.4800 30.8417 25.7435 15.0630 23.9130 24.2960 106.8290 11.8022 8.7725 40.8094 21.9440 19.2919 29.1578 251.8756
temp: 298.150 k
press: 1.00000 atm
elementType: 8 7 7 6 6 6 6 6 6 6 6 6 6 6 6 6 6 6 6 6 1 1 1 1 1 1 1 1 1 1 1 1 1 1 1 1 1 1 1 1 1 1 1 1 1 1
symmnumber: 1
zpe: 1045190.4 jmol-1
zpe.correction: 0.398092 hartree
zpe.thermalcorrener: 0.418381 hartree
zpe.thermalcorrenthalpy: 0.419325 hartree
zpe.thermalcorrgfe: 0.349594 hartree
zpe.sumelectzpe: -846.622737 hartree
zpe.sumelectthermal: -846.602448 hartree
zpe.sumelectthermalent: -846.601504 hartree
zpe.sumelectthermalfe: -846.671235 hartree
dipole: 3.2398 2.3175 -2.2953
dipole: 4.5973
quadrupole: -105.5810 -120.6834 -128.0090
quadrupole: -2.5428 2.0009 8.0763
quadrupole: 12.5101 -2.5922 -9.9178 -2.5428 2.0009 8.0763
hfenergy: -847.0208288 hartree
pointgroup: C01 [X(C17H26N2O1)]
dipole: 1.0878023 -1.4432143 0.0728857 debye
polarizability: 254.9432536|-4.3780957|181.8140537|1.0821491|38.0798294|175.5326498 unknown
InChI: InChI=1S/C17H26N2O/c1-12-10-13(2)15(4)17(14(12)3)18-16(20)11-19-8-6-5-7-9-19/h10,18H,5-9,11H2,1-4H3
charge 0 multiplicity 1
46 atoms
O  0.295275 3.055685 0.35128
N  2.825748 0.387831 0.496941
N  0.140255 0.697415 0.472866
C  3.898728 -0.097791 1.409553
C  3.241907 0.306519 -0.933018
C  4.275071 -1.557509 1.085232
C  3.605563 -1.13868 -1.326116
C  4.703385 -1.700685 -0.393719
C  2.311272 1.735628 0.843389
C  0.808167 1.909348 0.513602
C  -1.255941 0.473948 0.225026
C  -2.239222 1.120756 1.028957
C  -1.601871 -0.44149 -0.815122
C  -3.612811 0.879073 0.734033
C  -2.975492 -0.701109 -1.070656
C  -3.95069 -0.022307 -0.301117
C  -1.835403 2.01519 2.184031
C  -0.501211 -1.102307 -1.629608
C  -4.721171 1.557801 1.522886
C  -3.421785 -1.666184 -2.159009
H  3.529854 -0.01948 2.449113
H  4.812912 0.543369 1.327534
H  4.120295 0.974841 -1.120452
H  2.409892 0.681288 -1.557517
H  3.397989 -2.204769 1.281642
H  5.0885 -1.884206 1.760827
H  3.941246 -1.156644 -2.38049
H  2.698688 -1.770936 -1.256286
H  4.911139 -2.760071 -0.634744
H  5.647291 -1.141073 -0.559108
H  2.423039 1.897182 1.932953
H  2.855367 2.56101 0.33533
H  0.804285 -0.097264 0.509951
H  -5.011415 -0.208154 -0.512321
H  -2.632927 2.08553 2.941573
H  -1.59156 3.033179 1.827478
H  -0.924078 1.630986 2.677476
H  -0.899011 -1.595444 -2.530077
H  0.038735 -1.8768 -1.046643
H  0.250252 -0.358715 -1.952646
H  -4.727337 1.24035 2.583894
H  -4.611843 2.658145 1.517491
H  -5.710042 1.313996 1.098207
H  -3.008444 -2.681412 -2.008076
H  -4.52161 -1.752994 -2.174664
H  -3.102389 -1.331844 -3.165079
