program: Gaussian 09
title: 000216318
version: EM64L-G09RevD.01
frameworkgroup: C1[X(C16H26N2O)]
method: RPBEPBE
basis: SDD
operation: Freq
keyword: #p
keyword: freq=noraman
keyword: PBEPBE/SDD
title: #p freq=noraman PBEPBE/SDD
converged: YES YES NO NO
title: Mulliken charges:
elementType: O N N C C C C C C C C C C C C C C C C H H H H H H H H H H H H H H H H H H H H H H H H H H
charge: -0.245544 -0.165767 -0.476663 0.197137 0.150415 0.165394 -0.478959 0.398117 0.396717 -0.324902 -0.312968 -0.723085 0.143426 -0.853821 -0.832048 -0.849387 -0.850523 -0.690334 -0.671860 0.239199 0.236976 0.201623 0.224437 0.195823 0.207226 0.352287 0.231014 0.240505 0.243495 0.227066 0.218346 0.225003 0.282728 0.226545 0.228577 0.233438 0.226310 0.229699 0.236151 0.231719 0.212024 0.219982 0.223465 0.215423 0.215591
chargesum: 0.00000
title: Mulliken charges with hydrogens summed into heavy atoms:
elementType: O N N C C C C C C C C C C C C C C C C
charge: -0.245544 -0.165767 -0.124377 0.197137 0.150415 0.165394 -0.002784 0.398117 0.396717 0.101158 0.090081 -0.492071 0.143426 -0.142755 -0.105970 -0.160827 -0.158363 -0.026608 -0.017381
polarizability: 2.41798166e+02 -8.39514703e-01 2.10450695e+02 -7.29742146e+00 3.06092489e+00 1.37630674e+02
1716.lowfreq: -13.2223 -10.3843 0.0005 0.0007 0.0008 3.5962 12.7659 27.9541 55.1411
frequency: 10.3309 27.7741 55.1013 59.9901 80.2970 91.1911 100.2058 104.9162 116.0993 123.0075 154.6796 166.6723 172.6994 183.9743 199.7436 205.9889 222.1167 261.2324 284.4860 294.9200 309.7546 321.9739 331.1459 345.3934 351.9566 355.1328 397.8099 437.9069 447.7901 475.1062 508.4827 535.2926 549.1413 557.9764 585.1570 605.4605 671.0563 713.5743 760.1699 765.9414 796.2964 803.3873 814.5594 832.4584 875.8377 898.2205 909.3121 943.9694 986.3228 994.1808 995.0841 1017.5895 1023.3731 1029.0805 1047.4053 1052.7010 1058.3381 1065.2029 1075.1242 1083.5971 1088.3041 1099.0414 1115.4573 1157.7194 1193.6540 1201.2968 1234.3907 1248.7869 1250.1668 1278.9504 1290.2521 1319.6845 1329.4440 1360.7216 1362.2961 1373.1165 1390.8677 1392.7829 1394.0989 1394.7660 1400.2875 1402.2886 1404.9375 1445.3699 1449.0138 1455.4677 1462.3387 1466.6963 1468.5837 1470.4801 1473.0357 1475.0460 1477.3879 1478.9368 1482.3913 1485.6022 1486.4441 1491.5658 1494.7588 1503.9051 1584.7408 1615.9309 1632.5397 2880.8020 2888.6578 2958.7150 2959.2264 2968.3434 2969.5852 2980.3774 2984.7258 2989.6106 3023.1100 3042.3620 3044.2459 3045.9122 3046.0922 3046.5129 3059.5160 3078.5332 3078.9356 3079.0448 3082.9297 3089.5403 3090.4748 3091.2959 3094.6694 3114.2487 3304.8882
redmass: 3.2773 3.3320 3.6929 3.3579 2.1505 3.2784 1.8281 1.5346 1.8737 2.6883 1.6841 1.1041 1.0715 1.4517 1.5897 2.8792 1.5697 2.0006 2.3830 2.0560 3.3500 2.4490 2.8968 2.9934 2.6442 3.1696 3.4346 4.8778 2.6572 4.6187 3.7429 4.0281 3.7822 3.0098 3.3203 3.5871 3.9198 3.7178 2.7409 3.2967 1.1584 1.3033 1.3543 2.1725 1.3243 2.0007 3.0524 2.5440 1.8956 1.5745 1.8371 1.5212 1.4208 1.5043 2.1614 1.6352 1.7239 2.5521 1.9781 2.6336 2.0635 2.5874 2.0271 1.7423 2.5163 2.3715 4.3748 1.3702 1.3525 1.2055 1.1743 5.0117 1.4110 4.6584 1.4307 1.3567 1.2508 1.2296 1.2338 1.2507 1.2309 1.8155 1.7430 1.3865 1.1472 1.2455 1.1396 1.1291 1.0867 1.0532 1.1448 1.0860 1.1628 1.1511 1.0821 1.0716 1.0877 1.1039 1.0831 2.0025 5.8196 6.5922 8.0991 1.0715 1.0713 1.0461 1.0647 1.0380 1.0382 1.0370 1.0360 1.0359 1.0892 1.0959 1.0926 1.0888 1.0959 1.0908 1.0968 1.0989 1.0983 1.0983 1.0980 1.0984 1.1004 1.0998 1.0974 1.0909 1.0758
irintensity: 0.1678 0.1742 2.1263 1.6610 0.2944 0.6722 1.2280 0.7753 1.4420 0.8428 6.8303 0.5037 0.1426 1.1086 2.4567 0.4928 4.1867 6.0256 0.3078 1.9591 0.9503 0.2001 0.3392 0.2401 1.1491 1.3474 0.3019 0.2108 2.2592 20.8624 1.6873 16.6140 5.0656 2.8049 0.1021 4.6524 2.5191 3.0933 5.9100 6.4011 4.9837 8.2360 36.9953 21.5070 10.1712 12.1652 0.1257 14.7626 11.0762 13.1420 3.6474 16.0953 2.9223 14.5799 6.5268 0.5247 1.3624 22.7694 22.0658 0.1000 5.7238 10.6358 24.8476 12.9507 19.9443 22.0562 1.6059 5.6960 10.9081 12.3225 14.8625 0.4813 2.2879 15.0817 4.3434 15.5596 5.0102 17.0091 21.3450 10.1690 14.4609 9.9359 6.1428 90.3274 11.7059 22.5042 13.7290 39.2744 10.3662 8.6340 105.1353 5.4054 51.1913 55.6880 26.5450 7.4663 12.9297 15.6475 27.7996 154.4908 12.4008 7.1526 211.2118 32.6383 179.5321 44.5886 48.7838 52.3990 28.7158 24.6694 23.2624 23.4132 16.1269 32.5467 5.8676 5.8192 25.1851 16.4801 12.0998 15.5925 46.7462 35.6944 55.7153 20.7206 37.1420 60.0521 11.8182 28.9128 258.8414
temp: 298.150 k
press: 1.00000 atm
elementType: 8 7 7 6 6 6 6 6 6 6 6 6 6 6 6 6 6 6 6 1 1 1 1 1 1 1 1 1 1 1 1 1 1 1 1 1 1 1 1 1 1 1 1 1 1
symmnumber: 1
zpe: 1021728.1 jmol-1
zpe.correction: 0.389156 hartree
zpe.thermalcorrener: 0.411412 hartree
zpe.thermalcorrenthalpy: 0.412356 hartree
zpe.thermalcorrgfe: 0.336830 hartree
zpe.sumelectzpe: -808.567830 hartree
zpe.sumelectthermal: -808.545574 hartree
zpe.sumelectthermalent: -808.544629 hartree
zpe.sumelectthermalfe: -808.620155 hartree
dipole: 2.8490 2.1623 2.7413
dipole: 4.5063
quadrupole: -99.1651 -112.6068 -125.5409
quadrupole: 0.2789 -0.1777 -6.6649
quadrupole: 13.2725 -0.1692 -13.1033 0.2789 -0.1777 -6.6649
hfenergy: -808.9569853 hartree
pointgroup: C01 [X(C16H26N2O1)]
dipole: 1.0478935 -1.4293371 0.0464329 debye
polarizability: 242.2669225|2.2924436|165.4891936|1.5904216|-35.7788992|182.1234186 unknown
InChI: InChI=1S/C16H26N2O/c1-7-18(8-2)10-15(19)17-16-13(5)11(3)9-12(4)14(16)6/h9,17H,7-8,10H2,1-6H3
charge 0 multiplicity 1
45 atoms
O  0.721016 2.8554 -0.292334
N  3.19788 0.116984 -0.139666
N  0.525476 0.497808 -0.269548
C  -0.893046 0.322017 -0.134386
C  -1.363073 -0.487048 0.94374
C  -1.777746 0.914303 -1.082856
C  2.739543 1.474766 -0.540412
C  -2.762043 -0.699718 1.081381
C  -3.179048 0.723877 -0.907068
C  3.589284 0.091755 1.303716
C  4.239642 -0.448008 -1.047956
C  -3.639995 -0.077713 0.162282
C  1.220017 1.692118 -0.33934
C  -0.373125 -1.095878 1.923541
C  -1.241343 1.702301 -2.261186
C  -3.333494 -1.555864 2.20116
C  -4.185608 1.350927 -1.858378
C  3.647245 -1.322762 1.907775
C  3.673356 -0.873708 -2.415086
H  3.262887 2.288473 0.005255
H  2.941711 1.633391 -1.615757
H  4.567866 0.609668 1.457527
H  2.831964 0.683109 1.852433
H  5.079852 0.274673 -1.190761
H  4.668672 -1.337349 -0.553916
H  1.173605 -0.309465 -0.214727
H  -4.72064 -0.227052 0.281539
H  0.452151 -0.394317 2.139408
H  -0.855523 -1.356544 2.879321
H  0.081739 -2.027387 1.527264
H  -0.284331 1.277276 -2.614383
H  -1.950337 1.704304 -3.105416
H  -1.030791 2.748944 -1.972335
H  -2.915203 -2.580131 2.194198
H  -3.120032 -1.126411 3.199478
H  -4.429492 -1.640931 2.10669
H  -4.100899 0.935655 -2.881676
H  -5.217643 1.17087 -1.511748
H  -4.041885 2.444063 -1.942803
H  2.682326 -1.842619 1.773909
H  4.438653 -1.94442 1.452962
H  3.859882 -1.259155 2.990638
H  2.883304 -1.634113 -2.285313
H  3.238735 -0.023285 -2.971073
H  4.475496 -1.304402 -3.042296
