program: Gaussian 09
title: 000216278
version: EM64L-G09RevD.01
frameworkgroup: C1[X(C11H10O4)]
method: RPBEPBE
basis: SDD
operation: Freq
keyword: #pfreq=noraman
keyword: PBEPBE/SDD
title: #p freq=noraman PBEPBE/SDD
converged: YES YES NO NO
title: Mulliken charges:
elementType: O O O O C C C C C C C C C C C H H H H H H H H H H
charge: -0.250988 -0.279087 -0.244032 -0.443488 0.240475 0.079509 0.201888 0.028908 0.224147 -0.389001 -0.286222 -0.338101 -0.433562 -0.215523 -0.503653 0.282898 0.292150 0.260260 0.251215 0.239282 0.237433 0.245465 0.236586 0.220893 0.342550
chargesum: 0.00000
title: Mulliken charges with hydrogens summed into heavy atoms:
elementType: O O O O C C C C C C C C C C C
charge: -0.250988 -0.279087 -0.244032 -0.100938 0.240475 0.079509 0.201888 0.028908 0.224147 -0.106103 0.005928 -0.077841 0.056935 0.021909 0.199292
polarizability: 1.77543946e+02 2.88354902e+00 1.57521914e+02 3.83332197e+00 1.80400402e+00 6.49479875e+01
1716.lowfreq: -8.4197 -4.7536 -0.0010 -0.0007 -0.0006 1.4561 43.4119 57.8103 87.6152
frequency: 43.3849 57.8039 87.6149 96.9699 134.2260 160.7989 204.0578 223.5034 251.4991 279.1108 298.8369 317.1478 344.0853 375.7677 431.7437 442.8080 482.9716 510.8703 541.7020 566.7693 575.1787 667.1075 699.1201 710.4175 762.1432 793.4626 821.3630 869.8001 888.3538 912.5481 922.8414 954.8119 988.3600 989.7029 1028.2076 1057.5248 1107.2695 1117.6898 1150.5939 1159.2651 1160.9575 1173.7574 1225.8887 1258.7097 1282.3809 1307.5967 1341.9058 1385.3162 1390.7674 1420.2585 1434.6482 1458.0605 1460.3205 1466.6531 1469.8681 1545.1901 1580.9671 1599.1832 1625.4906 2990.3210 2993.2035 3066.7386 3099.5446 3129.4474 3147.7552 3167.0888 3178.3021 3197.9553 3559.2649
redmass: 3.1669 4.7032 3.5891 3.0132 4.7878 1.7076 3.0964 4.1060 3.1128 3.3109 5.1259 5.1403 1.4538 4.6287 5.4159 4.3824 8.5508 5.1819 5.4256 5.9907 5.4429 7.0480 5.4022 5.3988 2.4000 5.7035 1.9577 5.8289 1.4055 6.2782 1.4158 1.7394 4.5876 1.3353 4.4302 2.3720 1.3043 2.7600 1.4085 1.2390 2.0593 1.4988 2.4475 2.8542 1.5927 1.4775 1.3380 2.2645 8.1149 3.4244 1.3106 1.0552 1.0895 1.4770 1.5373 10.0538 6.6776 7.4809 7.0294 1.0315 1.0639 1.0989 1.1015 1.1051 1.0870 1.0921 1.0991 1.0947 1.0663
irintensity: 5.7973 1.6453 2.7888 14.6433 3.4205 1.6043 1.8814 1.9380 4.6520 25.2893 27.7348 10.5046 139.0562 6.7818 0.3074 2.7592 6.6535 2.5442 1.4930 3.7707 5.5758 11.4552 2.6946 17.5733 49.4716 18.1264 39.2548 10.4802 27.0118 12.5476 0.8069 68.0305 40.8383 1.9293 56.9717 18.9446 6.6521 25.0644 3.4966 22.6552 45.8020 34.6097 42.0542 117.8511 117.0744 28.3907 9.7101 66.0270 19.6000 27.3042 5.6713 12.0756 6.8039 72.9718 20.0569 229.1242 76.7699 7.4550 78.4232 56.7729 16.8879 10.2056 35.9230 24.5452 8.4010 0.4726 12.3204 0.1688 10.8566
temp: 298.150 k
press: 1.00000 atm
elementType: 8 8 8 8 6 6 6 6 6 6 6 6 6 6 6 1 1 1 1 1 1 1 1 1 1
symmnumber: 1
zpe: 491336.1 jmol-1
zpe.correction: 0.187140 hartree
zpe.thermalcorrener: 0.200763 hartree
zpe.thermalcorrenthalpy: 0.201707 hartree
zpe.thermalcorrgfe: 0.146395 hartree
zpe.sumelectzpe: -724.940798 hartree
zpe.sumelectthermal: -724.927175 hartree
zpe.sumelectthermalent: -724.926231 hartree
zpe.sumelectthermalfe: -724.981544 hartree
dipole: -2.0988 -2.4871 -0.4554
dipole: 3.2860
quadrupole: -89.8478 -84.6296 -85.5282
quadrupole: -4.0783 -8.2846 -0.7899
quadrupole: -3.1793 2.0390 1.1404 -4.0783 -8.2846 -0.7899
hfenergy: -725.1279383 hartree
pointgroup: C01 [X(C11H10O4)]
dipole: 0.8803215 0.835455 -0.4454695 debye
dipolederiv: -1.2978361 0.0545264 0.0910362 0.367886 -0.6053042 0.1056738 0.0138827 0.1548805 -0.1572685 -0.5413828 -0.4654151 0.0623542 -0.5863005 -1.3219795 0.186061 0.238465 0.3345581 -0.3931292 -0.8358321 -0.2089163 0.1181268 -0.3644679 -0.7668472 0.1734053 0.1596419 0.1580576 -0.415443 -0.8370943 0.1222905 -0.135265 0.1920434 -0.4860038 0.2091703 -0.2158467 0.2331599 -0.2622494 -0.6066671 -0.0714085 0.0876377 -0.0620975 0.0141855 0.0136296 0.0988971 0.0062079 0.0034288 0.3882535 -0.5199725 0.1065463 -0.3041553 0.3505659 -0.0795608 0.0816856 0.005848 0.0292761 -0.1131016 0.098546 -0.073841 -0.2017224 -0.653204 0.2060106 -0.0089285 0.1661655 -0.163673 1.0714923 0.0529389 -0.1343223 0.2823662 0.9697043 -0.2861639 -0.2286067 -0.2515361 0.2726925 0.4165045 0.8223225 -0.1497521 0.7055774 0.8252863 -0.2621572 -0.2670129 -0.4238706 0.1866678 -0.1255859 0.1134072 -0.0463834 -0.0227562 -0.0996743 -0.0173852 -0.0005534 -0.0285791 -0.1358195 1.010092 0.2033367 -0.1754534 0.1037989 0.3393448 -0.1158336 -0.1251126 -0.1335096 0.0034201 0.0541291 0.0439594 -0.0604419 -0.2099301 -0.2188051 0.0063092 -0.018137 -0.0354674 -0.1462789 0.5270625 -0.133985 0.1191418 -0.2119357 0.3983756 -0.1191903 0.2476365 -0.1576409 0.3542624 0.0453065 -0.1385309 0.016798 -0.0029377 0.1294402 -0.0663949 -0.0278577 -0.055732 -0.1281584 0.1826776 -0.0930436 0.0393691 0.2568378 0.8478383 -0.0221557 0.0328718 0.0626666 0.3020969 0.0895018 -0.0762118 0.0319267 -0.0061333 0.0521051 0.0308998 0.0188436 0.0391255 0.1505971 0.1004379 0.0181357 0.0055407 0.0368004 0.0383011 0.0364528 0.0002118 0.0366472 0.1589388 -0.0523796 0.0010978 0.0257099 0.0002726 0.1138706 0.0167248 0.0200753 0.0140314 0.1602959 0.0014253 0.0351812 0.0333625 0.0798103 0.0643158 -0.0199464 0.0262613 0.0075645 -0.070755 0.0170395 -0.0078077 -0.0499463 -0.0693911 -0.0852693 -0.0128038 -0.0496115 -0.0277654 0.063371 0.0336368 0.0870541 -0.0076566 0.0931731 -0.0542421 0.0415834 -0.0008341 0.0474546 0.1477019 0.0278436 0.1503857 -0.1023869 0.0338431 -0.0167006 0.0196508 -0.1072427 0.0106975 0.0217877 -0.091728 -0.1424121 0.0450072 -0.1015505 -0.0275604 0.015692 0.0371806 0.0146733 0.1113741 0.1042955 0.0731401 0.0585597 -0.033716 -0.0279831 0.0328235 0.0148591 -0.0903041 -0.1384672 0.431909 -0.0186187 0.094332 0.024685 0.2202402 -0.0924952 0.0592314 -0.0873329 0.0453309 unknown
polarizability: 176.9616392|-1.2556936|151.2419816|-10.7425719|-22.6445131|71.810227 unknown
InChI: InChI=1S/C11H10O4/c1-14-9-4-2-3-8-10(13)7(5-12)6-15-11(8)9/h2-4,6,12H,5H2,1H3
charge 0 multiplicity 1
25 atoms
O  0.207589 1.28677 -0.554221
O  3.09611 1.046614 -0.845891
O  -2.082365 -1.977084 0.699322
O  -3.980315 1.675716 -0.575248
C  0.106182 -1.07427 0.156105
C  0.851838 0.064931 -0.257605
C  -1.966869 0.323694 -0.002863
C  -1.371451 -0.986932 0.316892
C  2.269166 0.008053 -0.410926
C  0.782716 -2.29747 0.395749
C  -1.173396 1.363443 -0.412175
C  2.90913 -1.228345 -0.173992
C  -3.470456 0.490096 0.128403
C  2.174395 -2.372533 0.219623
C  2.799895 2.446889 -0.476851
H  0.183813 -3.157007 0.710836
H  -1.549513 2.35736 -0.661005
H  3.994876 -1.265002 -0.304855
H  -3.747929 0.648561 1.18462
H  -3.965938 -0.44462 -0.201095
H  2.703425 -3.314377 0.396229
H  1.97982 2.854679 -1.088273
H  3.737486 2.986438 -0.67951
H  2.541517 2.526512 0.594936
H  -3.970028 1.500186 -1.550404
