program: Gaussian 09
title: 000216274
version: EM64L-G09RevD.01
frameworkgroup: C1[X(C10H12N2O5)]
method: RPBEPBE
basis: SDD
operation: Freq
keyword: #p
keyword: freq=noraman
keyword: PBEPBE/SDD
title: #p freq=noraman PBEPBE/SDD
converged: NO YES NO NO
title: Mulliken charges:
elementType: O O O O O N N C C C C C C C C C C H H H H H H H H H H H H
charge: -0.338555 -0.191686 -0.161041 -0.205097 -0.194078 0.007900 0.013122 -0.028853 -0.638361 0.510843 -0.721146 -0.689374 -0.083092 -0.559193 0.335911 0.432435 -0.528721 0.218202 0.252171 0.218420 0.238731 0.195544 0.239549 0.224831 0.227633 0.214255 0.300056 0.333124 0.376471
chargesum: 0.00000
title: Mulliken charges with hydrogens summed into heavy atoms:
elementType: O O O O O N N C C C C C C C C C C
charge: 0.037916 -0.191686 -0.161041 -0.205097 -0.194078 0.007900 0.013122 0.189349 -0.167771 0.510843 -0.047322 -0.022655 -0.083092 -0.259137 0.335911 0.432435 -0.195597
polarizability: 1.80559182e+02 6.27329920e+00 1.85400398e+02 1.86685928e+01 9.80584423e-01 9.00709066e+01
1716.lowfreq: -12.0472 -10.8999 0.0007 0.0008 0.0011 0.5766 37.0294 42.5441 56.0831
frequency: 36.6670 42.5280 56.0753 63.4812 78.6734 120.7896 140.5191 156.6345 203.4229 227.6990 229.3046 275.1050 286.2372 318.0120 331.1109 343.3141 364.1718 389.1190 403.0332 418.1290 428.3610 475.5644 525.4177 533.6844 599.4144 630.0776 657.4615 689.4662 710.6370 730.2194 767.9200 775.0360 793.3380 875.6136 889.9133 914.2196 916.6997 943.8797 954.1380 963.1624 964.5713 1066.0256 1091.8599 1105.1220 1133.4922 1175.5660 1186.6416 1205.2072 1217.7547 1240.6734 1245.9182 1272.4501 1289.8920 1328.6267 1348.8632 1367.5167 1375.0737 1382.9785 1401.0621 1410.7766 1443.3078 1464.7482 1468.8172 1474.4690 1487.5952 1488.8329 1499.0039 1592.5330 1616.2567 2954.1665 2956.6733 2977.7024 2981.1907 3033.9450 3049.4980 3075.3789 3076.0220 3081.4603 3172.6383 3192.4758 3541.7269
redmass: 3.8030 11.1025 10.4069 6.3852 3.1281 6.9532 7.7681 7.9676 3.0246 3.1358 1.2501 4.7833 1.0866 7.7387 9.9842 8.5618 2.3186 2.8807 2.1814 2.0595 2.1863 3.1000 5.9906 4.6487 4.5035 4.3309 8.2404 8.0668 6.6741 8.9259 4.9266 4.6072 4.9676 2.8758 2.1988 3.5911 1.2241 1.5875 1.5547 1.6168 1.8535 1.8639 1.5116 1.5655 1.7998 2.5446 3.0514 12.8650 2.1234 2.3341 1.5268 1.5100 2.4370 1.5249 1.3875 8.8838 11.7958 1.2300 1.2201 4.6324 4.4068 1.8644 1.3630 1.0568 1.0541 1.1295 1.1566 7.6299 7.6967 1.0638 1.0451 1.0692 1.0494 1.0940 1.0942 1.0993 1.0995 1.0988 1.0924 1.0930 1.0653
irintensity: 0.0307 0.8535 0.0254 1.1524 0.4862 0.7865 2.0537 3.2500 0.0142 0.5398 0.0343 1.4964 3.0811 0.5318 0.9679 0.4367 1.1995 30.2153 19.1824 27.3057 56.7361 28.1300 5.8354 0.6214 4.4546 5.7141 44.2511 23.1689 10.8573 12.7940 0.5282 1.0660 6.8000 29.4807 8.7646 2.5198 3.1134 4.9364 30.0933 1.5702 1.2212 14.8160 21.1789 21.8918 106.3196 37.0161 26.9014 417.3833 90.0492 83.2232 29.1844 27.2329 25.4842 0.2573 0.4203 121.4581 81.0681 22.7277 12.6995 53.0461 13.8497 59.7535 23.1812 1.7306 21.6201 9.2409 18.0485 61.8410 35.4721 13.7003 37.4591 43.4731 11.3678 10.3354 31.2969 13.0209 23.2065 83.4157 2.8485 19.0889 106.4621
temp: 298.150 k
press: 1.00000 atm
elementType: 8 8 8 8 8 7 7 6 6 6 6 6 6 6 6 6 6 1 1 1 1 1 1 1 1 1 1 1 1
symmnumber: 1
zpe: 566412.4 jmol-1
zpe.correction: 0.215735 hartree
zpe.thermalcorrener: 0.232232 hartree
zpe.thermalcorrenthalpy: 0.233176 hartree
zpe.thermalcorrgfe: 0.170710 hartree
zpe.sumelectzpe: -872.440293 hartree
zpe.sumelectthermal: -872.423796 hartree
zpe.sumelectthermalent: -872.422852 hartree
zpe.sumelectthermalfe: -872.485319 hartree
dipole: -8.0556 0.4922 -1.2772
dipole: 8.1711
quadrupole: -98.0363 -127.4448 -98.6885
quadrupole: 0.4012 -1.6906 -0.1457
quadrupole: 10.0203 -19.3883 9.3680 0.4012 -1.6906 -0.1457
hfenergy: -872.6560284 hartree
pointgroup: C01 [X(C10H12N2O5)]
dipole: 3.1360942 -0.570369 -0.4173951 debye
polarizability: 183.059142|6.6300919|183.8458313|-16.1258298|1.4249812|89.1255136 unknown
InChI: InChI=1S/C10H12N2O5/c1-6(2)3-7-4-8(11(14)15)5-9(10(7)13)12(16)17/h4-6,13H,3H2,1-2H3
charge 0 multiplicity 1
29 atoms
O  1.294688 2.166826 -0.444888
O  -2.422278 2.697212 1.009763
O  -1.024467 3.574044 -0.569261
O  -1.695288 -3.465204 -0.281581
O  -3.421298 -2.064719 0.241896
N  -1.471006 2.598682 0.138882
N  -2.188768 -2.289608 -0.066785
C  3.414496 -0.784083 0.163827
C  2.424151 -0.517197 -1.022205
C  0.970473 -0.270073 -0.637748
C  3.59316 0.444555 1.086818
C  3.017507 -2.035133 0.98001
C  0.476636 1.054212 -0.398341
C  0.070652 -1.347145 -0.535738
C  -0.900033 1.245484 -0.074641
C  -1.278262 -1.130028 -0.180821
C  -1.779427 0.159344 0.060568
H  4.394482 -0.989621 -0.315259
H  2.452245 -1.400776 -1.686809
H  2.819971 0.321438 -1.634896
H  2.648349 0.722181 1.590168
H  3.978085 1.326982 0.534876
H  4.331245 0.224956 1.878879
H  3.786618 -2.256697 1.741726
H  2.057437 -1.887349 1.507256
H  2.918308 -2.926842 0.333522
H  0.402216 -2.370372 -0.733314
H  -2.823153 0.317933 0.342532
H  2.245066 1.907497 -0.558836
