program: Gaussian 09
title: 000210928
version: EM64L-G09RevD.01
frameworkgroup: C1[X(C12H18ClNO2)]
method: RPBEPBE
basis: SDD
operation: Freq
keyword: #p
keyword: freq=noraman
keyword: PBEPBE/SDD
title: #p freq=noraman PBEPBE/SDD
converged: YES YES NO NO
title: Mulliken charges:
elementType: Cl O O N C C C C C C C C C C C C H H H H H H H H H H H H H H H H H H
charge: -0.045813 -0.299259 -0.450353 -0.316988 -0.423560 -0.125983 -0.059745 -0.308009 -0.680719 -0.697534 0.513122 -0.314988 -0.326490 -0.209707 -0.229762 -0.242296 0.226704 0.229793 0.215142 0.213978 0.240060 0.241587 0.231893 0.213121 0.199793 0.233002 0.232370 0.209381 0.197370 0.357785 0.256981 0.254975 0.229722 0.234428
chargesum: 0.00000
title: Mulliken charges with hydrogens summed into heavy atoms:
elementType: Cl O O N C C C C C C C C C C C C
charge: -0.045813 -0.299259 -0.092568 -0.076928 0.032937 0.089159 0.154232 0.165471 -0.034803 -0.058413 0.513122 -0.314988 -0.069509 0.045268 -0.000039 -0.007868
polarizability: 1.73092241e+02 2.11400487e+01 1.47668298e+02 1.08816863e+01 -1.91446100e+01 1.35031971e+02
1716.lowfreq: -11.3619 -7.5050 0.0015 0.0018 0.0025 2.9517 13.7684 19.2499 32.2896
frequency: 13.3883 18.8893 32.2056 54.3336 83.0077 97.5477 130.4724 156.1410 175.6258 199.7109 206.7367 233.7946 252.2663 257.9840 260.4174 309.8307 377.8262 385.6550 420.7234 438.3804 445.3831 452.0429 472.6180 495.0070 538.8215 547.8309 624.6677 669.3648 684.1474 705.3800 750.6816 801.9641 825.6754 837.5029 847.6519 909.6080 914.7164 918.9309 927.0700 938.3076 951.7229 969.7445 994.9721 1020.0223 1039.5573 1065.6692 1097.4742 1100.8110 1127.4484 1129.9532 1149.7802 1169.6106 1173.2165 1223.1979 1228.6640 1241.4827 1249.9525 1261.4884 1312.4966 1320.2378 1335.5532 1347.4170 1365.4582 1374.1701 1380.8714 1381.9330 1389.2861 1429.2405 1447.5149 1447.7915 1462.3420 1463.8923 1473.2389 1479.0845 1481.1649 1483.9374 1574.9307 1604.8720 2933.2415 2966.9776 2973.2866 2983.9249 2984.5091 3027.1971 3045.1604 3060.5666 3061.9717 3070.9533 3072.3805 3093.3555 3139.6824 3155.3021 3167.5817 3178.3366 3416.3684 3523.4671
redmass: 5.0115 5.5850 2.7723 4.1188 7.7800 3.6497 3.6140 5.3039 3.4786 1.0491 2.7630 2.3272 2.0376 2.0398 5.4161 3.0465 4.1941 3.6474 2.3813 3.1877 2.2405 2.2730 1.5947 2.8707 3.8821 4.7413 4.3316 1.7900 4.1449 3.6164 1.2724 4.2623 2.4231 1.4505 2.7704 1.3173 1.7949 2.0510 1.5096 1.4947 3.5876 1.3130 1.9106 7.1611 1.9903 1.8779 1.9207 3.0022 1.6469 1.9585 1.5732 1.0706 2.0513 1.5192 1.5978 1.8747 1.4598 1.5711 1.3973 1.2583 1.3407 1.3352 1.3344 1.3627 1.7182 2.5007 1.2299 2.3272 1.1650 1.2359 1.0506 1.0566 1.9749 1.1002 1.0826 1.0556 6.4960 7.1937 1.0672 1.0358 1.0411 1.0807 1.0552 1.0874 1.0917 1.0986 1.1090 1.0974 1.0995 1.1001 1.0857 1.0900 1.0940 1.1003 1.0737 1.0653
irintensity: 0.0999 0.6710 0.2623 0.1107 0.3437 1.1250 0.7733 1.6324 6.7563 0.1661 3.9772 1.8536 1.9394 2.5903 0.6818 5.2312 0.7014 1.0644 0.2098 6.2309 56.6077 7.0469 115.5548 16.0605 0.2275 22.2972 10.4863 43.9510 57.0449 0.4838 107.0806 6.2005 5.2984 1.6262 16.2472 4.2092 10.3450 16.2392 11.3636 2.0007 49.7093 0.2222 28.0884 50.3489 22.1230 65.0168 20.3166 32.9074 8.7374 20.9666 25.9092 7.4081 71.3889 34.6773 89.8783 74.0916 15.7548 49.7001 9.0773 8.0854 2.7590 4.2581 9.5387 40.4821 14.6841 19.7768 27.0338 25.3435 22.4063 117.3463 6.4253 5.1693 62.7472 5.9684 7.3527 16.9785 11.1244 46.3841 58.5060 30.4828 22.7381 22.7687 24.7475 9.0515 45.8351 6.1425 19.8733 80.5911 41.0085 39.5468 2.7738 11.0798 13.1348 10.0430 1.4373 19.3368
temp: 298.150 k
press: 1.00000 atm
elementType: 17 8 8 7 6 6 6 6 6 6 6 6 6 6 6 6 1 1 1 1 1 1 1 1 1 1 1 1 1 1 1 1 1 1
symmnumber: 1
zpe: 735803.7 jmol-1
zpe.correction: 0.280253 hartree
zpe.thermalcorrener: 0.297795 hartree
zpe.thermalcorrenthalpy: 0.298739 hartree
zpe.thermalcorrgfe: 0.231939 hartree
zpe.sumelectzpe: -1132.062411 hartree
zpe.sumelectthermal: -1132.044868 hartree
zpe.sumelectthermalent: -1132.043924 hartree
zpe.sumelectthermalfe: -1132.110725 hartree
dipole: -0.7318 3.3508 -0.6577
dipole: 3.4922
quadrupole: -90.4184 -110.4870 -101.6667
quadrupole: 3.1377 0.0451 -5.7868
quadrupole: 10.4389 -9.6296 -0.8093 3.1377 0.0451 -5.7868
hfenergy: -1132.3426635 hartree
pointgroup: C01 [X(C12H18Cl1N1O2)]
dipole: 0.0185914 -0.7018446 -1.1810257 debye
polarizability: 176.4861834|22.2742615|121.3086826|4.7446587|-0.4511536|157.9976441 unknown
InChI: InChI=1S/C12H18ClNO2/c1-9(2)14-7-10(15)8-16-12-6-4-3-5-11(12)13/h3-6,9-10,14-15H,7-8H2,1-2H3
charge 0 multiplicity 1
34 atoms
Cl -1.646061 -0.18403 3.072361
O  -0.580588 0.807603 0.500631
O  1.124985 2.892538 1.063252
N  2.818903 0.119105 -0.865825
C  2.393025 0.883822 0.326816
C  1.401887 2.006329 -0.073669
C  3.287659 -1.275755 -0.637159
C  0.09901 1.440885 -0.653556
C  4.569511 -1.373764 0.235204
C  3.490794 -1.962253 -2.003074
C  -1.817804 0.201313 0.304829
C  -2.460549 -0.33547 1.451639
C  -2.466214 0.08397 -0.950705
C  -3.707613 -0.974213 1.363036
C  -3.721651 -0.557135 -1.044728
C  -4.346181 -1.088038 0.104583
H  1.879755 0.189312 1.018944
H  3.223249 1.36138 0.892735
H  1.870147 2.657398 -0.83525
H  2.464913 -1.794259 -0.104112
H  3.49904 0.644234 -1.435604
H  0.334514 0.685701 -1.427019
H  -0.544232 2.246938 -1.055544
H  4.832244 -2.429058 0.437405
H  5.427746 -0.901888 -0.282031
H  4.432638 -0.866746 1.207769
H  2.560045 -1.926498 -2.595199
H  3.790297 -3.017909 -1.874149
H  4.288286 -1.455657 -2.582142
H  0.50787 2.40373 1.669959
H  -1.991745 0.48783 -1.849447
H  -4.172924 -1.375711 2.268166
H  -4.208719 -0.639507 -2.02215
H  -5.318436 -1.584999 0.032736
