program: Gaussian 09
title: 000216256
version: EM64L-G09RevD.01
frameworkgroup: C1[X(C13H10ClF)]
method: RPBEPBE
basis: SDD
operation: Freq
keyword: #p
keyword: freq=noraman
keyword: PBEPBE/SDD
title: #p freq=noraman PBEPBE/SDD
converged: YES YES NO NO
title: Mulliken charges:
elementType: Cl F C C C C C C C C C C C C C H H H H H H H H H H
charge: -0.079665 -0.202367 -0.766482 0.550311 0.531972 -0.334650 -0.320598 -0.419567 -0.360703 -0.372964 -0.375946 -0.222263 -0.234758 0.327534 -0.235888 0.291362 0.247271 0.262285 0.233446 0.270423 0.259321 0.257967 0.230426 0.230956 0.232579
chargesum: 0.00000
title: Mulliken charges with hydrogens summed into heavy atoms:
elementType: Cl F C C C C C C C C C C C C C
charge: -0.079665 -0.202367 -0.475120 0.550311 0.531972 -0.087379 -0.058313 -0.186121 -0.090279 -0.113644 -0.117980 0.008162 -0.003802 0.327534 -0.003309
polarizability: 1.87616088e+02 1.33447700e+01 1.29389925e+02 7.29001209e+00 8.03626695e+00 1.19251189e+02
1716.lowfreq: -8.2461 -1.5594 -0.0018 0.0007 0.0017 10.4668 14.6788 38.6787 64.0659
frequency: 13.4994 38.6337 64.0570 85.7755 143.7411 183.6924 223.8932 256.4227 295.2206 353.1873 389.1421 401.3509 410.9955 454.2878 507.3750 532.7792 600.7119 611.6872 629.7721 662.4623 701.9853 719.4347 742.4728 782.8618 819.5067 820.0129 840.2738 854.4914 858.4758 928.6145 952.4680 967.3536 979.8904 989.2305 998.6014 1006.0758 1027.7502 1082.0817 1108.4515 1157.4082 1169.9717 1174.4750 1181.4304 1190.4987 1203.1727 1215.8254 1280.4068 1304.0344 1332.8951 1379.3705 1392.8275 1412.4281 1439.2782 1482.3416 1494.5090 1591.3437 1600.4534 1609.8726 1611.6994 3069.0715 3121.1537 3130.0380 3138.2008 3142.0701 3153.2944 3157.9150 3167.1667 3176.4141 3179.4930
redmass: 4.3384 4.1497 6.1944 8.7859 8.3735 8.4057 5.2951 6.1477 7.5499 7.1471 5.4023 2.8679 2.9589 5.2874 3.0251 4.6811 5.3095 6.2773 6.7389 5.2284 2.2188 2.4320 3.2524 2.9066 1.6092 2.4556 1.8679 1.5936 2.1102 1.4363 1.3615 1.3618 1.3898 5.9624 1.3152 2.8160 2.1960 1.6048 1.3260 1.4792 1.1600 1.1035 2.6196 1.1168 1.9647 1.6501 2.0583 1.4067 1.4027 8.3116 5.4361 2.9892 2.1499 2.3155 2.6191 6.0030 7.5220 6.3283 6.1193 1.0870 1.0871 1.0867 1.0902 1.0916 1.0958 1.0888 1.1015 1.0958 1.0970
irintensity: 0.1870 0.0907 0.3154 0.5909 3.2272 2.4355 1.4545 0.2562 7.1037 4.1139 3.0426 1.3642 0.1374 11.6244 5.8539 38.5004 37.3465 1.2128 13.7412 46.1028 39.1349 49.8474 14.3778 42.1115 3.9845 2.4149 49.1254 6.6094 15.4551 2.2653 0.9161 0.1270 0.1338 0.7794 0.0892 9.3302 5.8507 7.4136 10.7211 62.7660 9.4904 3.3157 12.2325 0.6054 29.2417 24.3117 36.4729 5.8691 2.2976 0.6394 0.7177 5.5566 13.5272 5.1923 84.8623 0.8242 11.9882 43.3419 5.8836 5.5670 5.4846 0.3109 6.1277 17.6248 25.2013 1.5554 20.0097 3.7195 3.4080
temp: 298.150 k
press: 1.00000 atm
elementType: 17 9 6 6 6 6 6 6 6 6 6 6 6 6 6 1 1 1 1 1 1 1 1 1 1
symmnumber: 1
zpe: 494642.6 jmol-1
zpe.correction: 0.188399 hartree
zpe.thermalcorrener: 0.201110 hartree
zpe.thermalcorrenthalpy: 0.202054 hartree
zpe.thermalcorrgfe: 0.146512 hartree
zpe.sumelectzpe: -1060.243150 hartree
zpe.sumelectthermal: -1060.230440 hartree
zpe.sumelectthermalent: -1060.229496 hartree
zpe.sumelectthermalfe: -1060.285037 hartree
dipole: -1.7241 -1.5807 1.3443
dipole: 2.6978
quadrupole: -95.8960 -97.6787 -85.6514
quadrupole: 10.9438 2.8530 5.4966
quadrupole: -2.8206 -4.6034 7.4240 10.9438 2.8530 5.4966
hfenergy: -1060.4315499 hartree
pointgroup: C01 [X(C13H10Cl1F1)]
dipole: -0.6832685 -0.7112988 0.3921427 debye
dipolederiv: -0.4257766 0.0360576 0.0151159 0.2107681 -0.841884 0.0418231 -0.0947665 0.2066174 -0.1852508 -1.1041166 0.3466192 0.1551239 0.3890902 -0.3228223 -0.0963058 0.1996042 -0.1075302 -0.2202228 0.8027152 -0.0949045 -0.0314197 -0.1304143 1.054056 -0.0867075 0.0113628 -0.2050002 0.2470982 -0.2561125 0.0174676 0.0098362 -0.21637 -0.1738783 -0.0276846 0.0978584 -0.0458909 -0.1081449 0.0352144 0.0749029 -0.0076719 0.0640562 -0.145969 0.0071318 0.0168238 0.0651857 -0.0537931 0.088139 -0.0434366 0.0209779 -0.0069389 0.0101819 0.1348978 0.0978277 0.0987064 0.0113684 0.0390474 -0.0152044 -0.0050838 -0.0135934 -0.0057455 0.0692142 -0.0168518 0.1099503 -0.0208883 -0.1126133 0.0122506 0.085297 -0.0070788 -0.1396111 -0.0102429 -0.028233 -0.081062 0.066207 -0.1486844 0.0243483 -0.032777 0.1066449 -0.0171475 -0.0733217 0.0058836 -0.0247422 -0.0379448 -0.154987 0.041452 0.0593068 0.2097295 -0.1954031 0.0094895 0.1994305 -0.0465718 -0.1268978 -0.3484019 0.0874654 0.0312531 -0.060129 -0.0690293 0.0792643 -0.123093 0.1108769 -0.0576331 -0.0611953 0.0700641 -0.0540073 0.1067296 -0.0300592 -0.0928466 -0.0493732 -0.0814006 0.018293 -0.0775649 0.0213368 0.093135 0.0089845 -0.1110647 -0.0202321 0.1132175 -0.0154101 0.116384 1.1790266 -0.3717843 -0.1508524 -0.4210298 0.3303698 0.1658774 -0.2022637 0.1706905 0.2464003 -0.0007162 0.1216662 0.049299 0.1166011 -0.0616897 0.0078425 0.02492 0.0016002 -0.0518389 0.0122837 -0.0187967 -0.0085956 0.0546822 -0.03153 0.0294188 -0.019418 -0.0004344 -0.0732591 0.0969472 0.0314997 0.0332167 0.018918 0.0370861 -0.1049874 0.0123036 -0.0930374 0.0286357 0.0668157 -0.032976 -0.0744766 -0.0706783 0.0891332 -0.0297387 -0.0972071 -0.0444502 0.0708994 0.095954 -0.0209647 -0.0977978 -0.0319444 0.1136054 -0.0098319 -0.0804727 0.0045199 -0.0651861 0.1085041 -0.0509899 0.0466755 -0.0694535 0.06068 0.0682555 0.0673958 0.0504772 0.0408628 -0.0166997 -0.015995 -0.0644924 -0.0157663 0.1367249 -0.053889 -0.0677934 -0.0536579 0.1005481 0.0837797 0.0227307 0.0007547 0.0338771 0.0753245 -0.1050581 0.0241889 -0.1080334 0.0628924 0.0539721 -0.0899143 0.0507214 -0.1005067 0.0579788 0.0906826 0.063401 0.0940968 -0.0078425 0.0756272 -0.0292255 -0.0739695 -0.0404301 0.116676 0.0223604 -0.0994076 0.0113422 -0.0829237 -0.0311581 -0.1236694 -0.0495691 -0.1357479 0.0640171 -0.0154118 -0.0553375 -0.0168421 0.0822366 unknown
polarizability: 187.6713013|11.2728908|125.7294401|10.0598829|9.3630849|122.8564597 unknown
InChI: InChI=1S/C13H10ClF/c14-13(10-4-2-1-3-5-10)11-6-8-12(15)9-7-11/h1-9,13H
charge 0 multiplicity 1
25 atoms
Cl -0.49031 2.916277 -0.048052
F  4.705824 -1.100632 -0.52977
C  -0.425775 1.117686 0.713861
C  0.915059 0.510906 0.356046
C  -1.664872 0.349987 0.302624
C  2.062685 0.910825 1.093223
C  1.065441 -0.445206 -0.680797
C  -2.310634 -0.455515 1.275353
C  -2.177022 0.374676 -1.019308
C  3.335811 0.380819 0.805913
C  2.331968 -0.989437 -0.984952
C  -3.436836 -1.236283 0.930329
C  -3.306009 -0.39983 -1.362817
C  3.438724 -0.560602 -0.234183
C  -3.937212 -1.212065 -0.391226
H  -0.459462 1.351511 1.789758
H  1.958715 1.655706 1.890421
H  0.189505 -0.780928 -1.243084
H  -1.930588 -0.475496 2.304206
H  -1.710825 1.031544 -1.761425
H  4.226713 0.681956 1.364059
H  2.462906 -1.730097 -1.778986
H  -3.925954 -1.852621 1.69262
H  -3.698501 -0.363931 -2.385127
H  -4.815646 -1.809752 -0.658582
