program: Gaussian 09
title: 000216284
version: EM64L-G09RevD.01
frameworkgroup: C1[X(C18H26O5)]
method: RPBEPBE
basis: SDD
operation: Freq
keyword: #pfreq=noraman
keyword: PBEPBE/SDD
title: #p freq=noraman PBEPBE/SDD
converged: YES YES NO NO
title: Mulliken charges:
elementType: O O O O O C C C C C C C C C C C C C C C C C C H H H H H H H H H H H H H H H H H H H H H H H H H H
charge: -0.450306 -0.432220 -0.272760 -0.417062 -0.425365 -0.077368 -0.418634 -0.472477 -0.417796 -0.375628 -0.372795 -0.405217 -0.408841 0.043008 -0.605545 0.476667 -0.710956 -0.068722 0.226723 -0.568197 0.180622 0.337127 -0.554725 0.192311 0.219555 0.213270 0.190351 0.238860 0.244208 0.199042 0.223721 0.224678 0.195269 0.205575 0.186935 0.210086 0.198807 0.211521 0.262655 0.286717 0.208101 0.218804 0.217537 0.237729 0.327974 0.263767 0.251934 0.399120 0.361943
chargesum: 0.00000
title: Mulliken charges with hydrogens summed into heavy atoms:
elementType: O O O O O C C C C C C C C C C C C C C C C C C
charge: -0.122332 -0.432220 -0.272760 -0.017942 -0.063422 0.114942 0.014192 -0.043267 0.025455 0.072770 0.028048 -0.008195 0.001487 0.305664 -0.110728 0.476667 -0.036886 -0.068722 0.226723 -0.304430 0.180622 0.337127 -0.302791
polarizability: 2.68771694e+02 2.21565709e+01 2.21039238e+02 2.32156725e+01 -1.76604762e+01 1.64379412e+02
1716.lowfreq: -12.0806 -7.9565 -0.0003 0.0004 0.0008 6.0788 21.2124 41.7643 63.8750
frequency: 21.1128 41.7246 63.8126 75.9253 85.1815 92.8232 100.1828 111.9681 123.3227 157.5032 166.5625 190.3005 201.5471 212.0462 214.2564 219.5689 250.2120 275.6320 296.2761 300.3633 313.3016 326.6778 332.8067 345.1900 378.5113 380.2771 393.3023 406.0102 410.4675 422.8169 450.1651 475.1708 509.0495 518.4205 546.6247 568.9994 602.2606 608.7077 616.8271 627.4584 670.8633 725.3233 734.2707 748.7847 765.7562 785.8310 798.5428 809.3913 814.4314 835.5631 840.3122 856.9696 873.5616 880.7812 903.0965 933.1410 947.7631 967.8924 972.8175 983.4172 997.7735 1007.0465 1030.8520 1044.1185 1062.0093 1073.4873 1088.5251 1097.9537 1103.6106 1114.0325 1130.8333 1138.7902 1146.6589 1160.1393 1169.4689 1176.3987 1193.3715 1219.4329 1231.0915 1237.4514 1241.7024 1265.3032 1270.7957 1285.3424 1296.7325 1303.9893 1306.7084 1309.8665 1314.9357 1326.9552 1333.9233 1338.8156 1342.8537 1348.5310 1363.5151 1364.4841 1374.8287 1391.1152 1394.8962 1398.6691 1447.6702 1450.8792 1460.8288 1464.1138 1467.0790 1468.1706 1474.9425 1476.5900 1482.1135 1492.3227 1494.3261 1517.0398 1584.1960 1614.9133 1643.5950 2921.6847 2950.4697 2959.4586 2966.8843 2968.3834 2971.1830 2987.8975 2993.2989 2996.1708 2997.4598 3011.5308 3019.6578 3024.3793 3025.0488 3042.7001 3051.8272 3055.9257 3070.8725 3083.5737 3090.9845 3097.6290 3117.9669 3152.9274 3162.0835 3549.6903 3577.3194
redmass: 5.2772 5.1517 5.6498 3.8195 4.9856 3.6403 3.1265 4.3595 3.0708 3.5837 3.6463 3.0610 3.5862 1.5187 2.1026 2.2556 2.5159 4.5901 2.9680 3.7678 2.2225 1.3166 3.6689 3.4587 3.8002 4.8836 3.4733 1.1404 3.1618 2.6088 3.0730 2.8544 3.7024 4.3864 5.2020 5.0825 4.0944 2.9634 5.7071 3.0738 4.0670 1.2467 1.5009 3.0194 5.4495 2.1070 1.9277 2.3915 1.2894 1.5097 1.9630 2.1080 1.7358 2.0799 1.7500 2.3090 2.1760 7.9990 2.3821 2.3225 3.2617 1.7264 2.8546 1.8486 2.4610 2.3036 2.0244 1.8924 1.9692 1.7821 1.9887 1.7662 1.7509 1.2844 1.3301 1.3271 2.7053 1.4378 1.3326 1.6296 1.3778 1.3047 1.2329 1.1852 1.2332 1.3469 1.3941 1.2917 1.3011 1.3882 1.6862 1.7449 1.8362 1.6767 1.4772 1.5550 1.4711 1.2466 1.6285 2.6702 1.1040 2.8847 1.1304 1.0787 1.0570 1.0846 1.0563 1.0756 1.0892 1.0994 1.1078 2.2421 6.3173 8.6213 4.8898 1.0811 1.0700 1.0592 1.0631 1.0602 1.0685 1.0365 1.0608 1.0706 1.0627 1.0962 1.0924 1.0962 1.1001 1.0974 1.0892 1.1012 1.0975 1.0891 1.0749 1.0996 1.0913 1.0924 1.0919 1.0658 1.0660
irintensity: 0.5593 0.0414 2.8483 0.2083 1.2909 1.5816 0.2799 1.5182 2.0292 1.7701 1.8405 0.8854 1.2041 0.1769 0.3769 4.2132 2.5092 2.9094 10.6530 3.3828 32.6266 121.3702 4.7785 13.3882 4.4589 9.2662 1.7371 127.0284 13.8007 2.4618 0.8653 5.0795 7.0354 12.7063 10.1708 13.4245 3.1774 2.4262 0.9663 4.9096 23.8515 13.5773 9.5901 3.2263 33.2357 11.4012 7.2667 18.9815 147.0654 0.7981 3.2001 41.2328 22.6377 5.1886 9.6606 17.7174 77.6128 366.5765 17.6450 16.5478 1.1616 5.4406 7.9117 20.3299 7.0527 8.8383 4.6670 5.5274 24.4676 66.6321 343.5957 26.9275 1.9917 19.0568 40.0679 13.7711 4.6256 27.7322 19.0528 117.7932 6.4922 41.3537 3.8237 2.0074 0.5785 39.2350 17.6053 4.4713 5.1869 18.2195 23.1544 35.2222 5.4050 24.8389 2.3836 3.0636 1.8316 26.0295 5.7765 48.8853 10.7623 29.0930 21.8785 1.3540 14.5668 6.3787 10.7775 3.8042 15.3187 21.8403 25.3488 0.3743 187.6863 538.2956 171.8597 45.6750 61.4613 14.5609 40.0907 37.4206 32.7917 28.8595 10.7709 39.8255 22.2483 39.8282 8.4548 5.5913 74.3960 19.2950 21.8879 69.5775 62.9027 288.9828 216.9261 33.1695 5.9793 5.1530 3.3951 3.0355 60.5811
temp: 298.150 k
press: 1.00000 atm
elementType: 8 8 8 8 8 6 6 6 6 6 6 6 6 6 6 6 6 6 6 6 6 6 6 1 1 1 1 1 1 1 1 1 1 1 1 1 1 1 1 1 1 1 1 1 1 1 1 1 1
symmnumber: 1
zpe: 1080614.7 jmol-1
zpe.correction: 0.411584 hartree
zpe.thermalcorrener: 0.434658 hartree
zpe.thermalcorrenthalpy: 0.435602 hartree
zpe.thermalcorrgfe: 0.360181 hartree
zpe.sumelectzpe: -1075.872228 hartree
zpe.sumelectthermal: -1075.849154 hartree
zpe.sumelectthermalent: -1075.848210 hartree
zpe.sumelectthermalfe: -1075.923631 hartree
dipole: 1.1030 2.0978 0.4048
dipole: 2.4044
quadrupole: -123.1571 -135.4192 -144.3648
quadrupole: 7.2624 11.9560 -4.5976
quadrupole: 11.1566 -1.1055 -10.0511 7.2624 11.9560 -4.5976
hfenergy: -1076.283812 hartree
pointgroup: C01 [X(C18H26O5)]
dipole: -0.3664301 -0.8669461 0.0948011 debye
polarizability: 264.1255857|27.9427209|221.7516877|-24.2009376|20.0289596|168.3130699 unknown
InChI: InChI=1S/C18H26O5/c1-12-6-5-9-14(19)8-4-2-3-7-13-10-15(20)11-16(21)17(13)18(22)23-12/h10-12,14,19-21H,2-9H2,1H3
charge 0 multiplicity 1
49 atoms
O  -4.834712 1.497096 -1.275672
O  -0.321069 -2.052717 0.041555
O  -0.428527 -0.590925 1.846583
O  1.741854 -2.323844 -1.327528
O  5.201653 1.019684 -1.128885
C  -3.88121 1.395237 -0.142028
C  -2.661599 2.235762 -0.56128
C  -3.573621 -0.089648 0.184229
C  -1.606754 2.402305 0.558633
C  -2.876807 -0.857098 -0.962635
C  -0.255767 2.92954 0.019623
C  -2.655407 -2.361212 -0.680638
C  0.843657 3.08676 1.097007
C  -1.641174 -2.668577 0.439829
C  1.341162 1.757859 1.753111
C  2.02222 0.819298 0.754726
C  -1.390125 -4.163945 0.656568
C  1.455126 -0.419118 0.262735
C  0.197036 -0.959142 0.821543
C  3.266491 1.251223 0.259823
C  2.185899 -1.145718 -0.757673
C  3.968982 0.504788 -0.713579
C  3.433098 -0.686542 -1.231883
H  -4.342059 1.855363 0.762366
H  -3.032039 3.226687 -0.886981
H  -2.198824 1.773027 -1.453872
H  -4.53175 -0.597037 0.433692
H  -2.957905 -0.128774 1.103694
H  -1.438242 1.437004 1.066842
H  -1.990175 3.098252 1.3336
H  -3.485648 -0.747489 -1.880674
H  -1.897097 -0.395798 -1.187511
H  -0.418783 3.913882 -0.46573
H  0.106384 2.249127 -0.778151
H  -3.615604 -2.83755 -0.391772
H  -2.317437 -2.866779 -1.607283
H  0.465603 3.740344 1.909866
H  1.711538 3.610668 0.648882
H  -1.926515 -2.177364 1.386052
H  0.513176 1.25756 2.271959
H  2.087603 2.032009 2.524249
H  -2.326987 -4.657517 0.973683
H  -1.045335 -4.65142 -0.273316
H  -0.632814 -4.327932 1.442002
H  -5.653715 0.988826 -1.043561
H  3.712406 2.180991 0.624735
H  3.943495 -1.281832 -1.996355
H  0.817124 -2.520882 -0.955082
H  5.622489 0.43437 -1.807196
