program: Gaussian 09
title: 000216244
version: EM64L-G09RevD.01
frameworkgroup: C1[X(C6H14N2O4)]
method: RPBEPBE
basis: SDD
operation: Freq
keyword: #p
keyword: freq=noraman
keyword: PBEPBE/SDD
title: #p freq=noraman PBEPBE/SDD
converged: NO YES NO NO
title: Mulliken charges:
elementType: O O O O N N C C C C C C H H H H H H H H H H H H H H
charge: -0.445553 -0.480091 -0.430161 -0.441675 -0.601870 -0.650938 -0.223710 -0.237074 -0.105072 -0.109917 -0.072571 -0.102729 0.258860 0.261396 0.187986 0.206578 0.201075 0.225866 0.304659 0.267330 0.285863 0.298095 0.328448 0.367640 0.349575 0.357988
chargesum: 0.00000
title: Mulliken charges with hydrogens summed into heavy atoms:
elementType: O O O O N N C C C C C C
charge: -0.117106 -0.112451 -0.080586 -0.083686 -0.029880 -0.066980 0.035149 0.024322 0.082914 0.096662 0.128504 0.123137
polarizability: 1.03012964e+02 1.20058732e+00 9.85462526e+01 5.33279743e-01 -4.31936563e-01 7.11850808e+01
1716.lowfreq: -6.9860 0.0007 0.0008 0.0009 10.4852 21.9319 79.2968 82.1146 121.6464
frequency: 79.2644 82.1108 121.6393 192.7289 210.7045 225.0122 238.9014 267.1375 271.4590 303.3446 305.3556 360.4769 376.6571 385.6954 398.9992 401.9947 432.1558 441.8484 447.6468 550.1537 563.9088 582.7428 599.0569 614.5708 626.5077 783.0764 919.1995 943.9701 960.7037 977.9070 981.7870 1030.5318 1044.7209 1051.9649 1076.0789 1087.3594 1106.5773 1132.4487 1145.7752 1148.7782 1165.6250 1215.6014 1232.8214 1243.5092 1259.1222 1279.6885 1296.2681 1306.1589 1311.0518 1333.9916 1347.0511 1354.1003 1381.1596 1390.6098 1397.4017 1425.0395 1621.8014 1646.7682 2899.7125 2907.6211 2921.7026 2972.0299 3009.5904 3018.4739 3390.1442 3419.1817 3424.1777 3495.4680 3528.6039 3538.7866 3551.0044 3638.5445
redmass: 5.7096 5.2166 5.1188 2.1856 3.3729 3.8126 3.9793 3.2729 3.7614 1.8224 1.2705 3.0317 2.7541 4.2536 2.5891 1.4208 3.7021 1.3971 1.2155 3.7787 2.3961 1.4170 2.4010 1.5861 1.4870 1.4829 2.7599 2.7861 6.6093 4.4489 3.3295 2.2492 2.4003 2.1426 5.0808 2.8276 2.0263 1.6213 2.0235 2.1835 1.7104 1.2844 1.2460 1.1205 1.3142 1.2984 1.1899 1.2548 1.3759 1.2178 1.3845 1.3936 1.4219 1.5713 1.3793 1.7643 1.1024 1.0901 1.0821 1.0818 1.0814 1.0847 1.0842 1.0847 1.0639 1.0638 1.0472 1.0452 1.0652 1.0654 1.0942 1.1005
irintensity: 4.4048 2.6776 10.9096 107.8632 2.1413 54.6231 0.8107 28.0082 2.6189 42.5992 10.3061 14.7960 6.0755 3.2914 54.6998 44.4744 43.7810 112.4938 149.1428 8.8585 53.2713 125.0411 19.1772 18.1725 207.2911 218.9137 89.2500 15.5300 61.0587 37.7475 15.5486 17.3558 160.5275 72.7483 23.7374 15.2664 2.7832 3.7468 23.3418 12.9460 7.4404 13.0064 4.0309 31.8389 31.0623 5.3278 69.2286 19.6337 10.2114 21.5682 11.7403 1.8979 2.2312 16.0636 4.8870 24.8001 43.5707 46.0956 10.1631 17.4133 99.2160 50.9400 0.2903 63.2957 65.0317 26.1522 1.0060 4.4781 1.7481 13.8329 5.5181 11.7484
temp: 298.150 k
press: 1.00000 atm
elementType: 8 8 8 8 7 7 6 6 6 6 6 6 1 1 1 1 1 1 1 1 1 1 1 1 1 1
symmnumber: 1
zpe: 564600.1 jmol-1
zpe.correction: 0.215045 hartree
zpe.thermalcorrener: 0.228168 hartree
zpe.thermalcorrenthalpy: 0.229112 hartree
zpe.thermalcorrgfe: 0.177150 hartree
zpe.sumelectzpe: -646.413745 hartree
zpe.sumelectthermal: -646.400622 hartree
zpe.sumelectthermalent: -646.399678 hartree
zpe.sumelectthermalfe: -646.451640 hartree
dipole: 1.8959 6.1647 1.6406
dipole: 6.6550
quadrupole: -65.0406 -83.6210 -69.2931
quadrupole: 7.3275 0.4654 2.8831
quadrupole: 7.6110 -10.9695 3.3585 7.3275 0.4654 2.8831
hfenergy: -646.6287901 hartree
pointgroup: C01 [X(C6H14N2O4)]
dipole: 0.2811493 -2.5375785 -0.5805126 debye
dipolederiv: -0.3265873 -0.1047461 -0.1509764 -0.0219769 -0.890036 0.0454936 -0.1551826 0.0716045 -0.4601691 -0.7835815 0.1342692 0.0565643 0.2245867 -0.5451551 0.0140247 0.0821095 0.051254 -0.5200025 -0.6939468 -0.1994625 -0.0709776 -0.2726526 -0.5135306 0.0577921 -0.0983203 0.0643201 -0.4837076 -0.2973295 0.0009845 -0.154381 -0.0006688 -0.911029 0.0399285 -0.1535464 0.0732194 -0.4626829 -0.8764638 -0.0117421 0.0387029 0.0283807 -0.5244362 -0.0588834 0.0388573 -0.0457142 -0.1820995 -0.9308681 -0.1190165 -0.0031153 -0.165415 -0.7260812 -0.0730137 0.0297258 -0.0807713 -0.1761697 0.4509949 0.0915163 0.0188305 0.1930928 0.2017765 0.069649 0.0248802 0.0403015 0.1352894 0.4834343 -0.1580455 -0.0474244 -0.1600585 0.1871809 0.0735421 -0.0368186 0.0437143 0.0975945 -0.0303981 -0.0365416 0.070521 -0.078378 0.5448353 -0.1295836 0.0759054 -0.0345549 0.4003233 0.4394926 -0.1301213 -0.1173572 -0.1536486 0.1099836 0.0306718 -0.0707292 -0.0091462 0.3923615 0.4599741 0.1391811 0.1104346 0.1789893 0.2155154 0.0124949 0.0537607 -0.0315273 0.4089791 0.234535 -0.0648308 0.0587879 -0.0606977 0.6521123 -0.0904401 0.0690891 -0.0615556 0.3374746 0.025432 -0.0140688 -0.0300565 -0.0076321 0.066765 -0.0104445 -0.0220256 -0.0018874 -0.1112658 0.0275979 0.0218973 0.0196731 0.0043922 0.0661651 -0.0012539 0.0047098 0.0035962 -0.1092619 0.0042722 -0.0040783 0.0007062 0.0048852 -0.0245851 0.0369911 -0.014807 0.0309203 -0.2288325 -0.0091259 0.0123597 0.0258127 0.0213579 0.0116183 -0.0438922 0.0373096 -0.0449902 -0.2180677 -0.0089377 -0.0043841 -0.0248239 -0.0224477 0.0146544 -0.0462667 -0.0350859 -0.0346511 -0.2168496 0.0289619 -0.0023917 0.0109276 0.0094589 -0.012683 0.0378653 -0.0110038 0.0460158 -0.1768392 0.3006733 0.0102619 -0.0743738 -0.099936 0.0490323 0.0674812 -0.0811315 0.0251428 0.185886 0.2640078 -0.0390844 0.0862388 -0.0949423 0.1986184 -0.0444683 -0.0163686 -0.045951 0.0051593 0.2476287 0.0784541 -0.0646636 0.1252136 0.2544942 -0.0410208 0.0047506 -0.0310714 0.057532 0.2589786 0.0641068 0.0470694 0.1603323 0.1365682 0.0677536 0.050354 0.039642 0.1497153 0.1079726 0.2052718 0.0904586 0.0893062 0.3281029 0.01027 0.1072744 -0.0017047 0.2754903 0.2820365 -0.0619059 0.0031767 -0.1368312 0.3806839 -0.0065084 -0.0117516 -0.0308246 0.3114428 0.2225352 0.0944527 0.0093282 0.1707853 0.3461181 -0.0343742 0.0256499 -0.0538035 0.2919686 0.1187111 0.0976641 0.0909173 0.0645045 0.3833116 0.0161918 0.1023951 0.0184224 0.2967313 unknown
polarizability: 102.4126553|-1.9535331|99.0931658|-0.8898686|-1.0561232|71.2384759 unknown
InChI: InChI=1S/C6H14N2O4/c7-1-3(9)2(8)5(11)6(12)4(1)10/h1-6,9-12H,7-8H2
charge 0 multiplicity 1
26 atoms
O  0.104195 -2.805515 0.332267
O  -2.377258 1.38757 0.31278
O  2.479526 1.520095 0.344056
O  -0.024619 2.853322 -0.409753
N  -2.455061 -1.372097 -0.043044
N  2.653377 -1.235276 -0.182776
C  -1.160062 -0.744562 0.304413
C  1.364965 -0.650588 0.235267
C  0.111033 -1.442611 -0.217667
C  -1.189884 0.710923 -0.207984
C  1.326958 0.837668 -0.231388
C  0.037662 1.533493 0.219769
H  -1.102976 -0.728456 1.410946
H  1.373896 -0.644834 1.343922
H  0.088847 -1.484047 -1.333911
H  -1.228361 0.703798 -1.323629
H  1.370644 0.875396 -1.345592
H  0.038459 1.627542 1.327497
H  -2.63134 -2.229879 0.492252
H  -2.548816 -1.555726 -1.051677
H  2.782107 -1.421791 -1.180174
H  3.110173 -1.894938 0.446144
H  0.968532 -3.232933 0.097122
H  -3.08476 0.67854 0.320413
H  3.23286 0.87284 0.229578
H  -0.9167 3.229467 -0.188432
