program: Gaussian 09
title: 000210925
version: EM64L-G09RevD.01
frameworkgroup: C1[X(C18H32N8O)]
method: RPBEPBE
basis: SDD
operation: Freq
keyword: #p
keyword: freq=noraman
keyword: PBEPBE/SDD
title: #p freq=noraman PBEPBE/SDD
converged: YES YES NO NO
title: Mulliken charges:
elementType: O N N N N N N N N C C C C C C C C C C C C C C C C C C H H H H H H H H H H H H H H H H H H H H H H H H H H H H H H H H
charge: -0.300246 -0.087718 -0.148264 -0.118047 -0.181613 -0.111061 -0.136291 -0.125322 -0.587417 -0.368613 -0.354772 -0.384991 -0.425398 -0.402538 -0.376629 -0.377052 -0.399066 -0.395110 -0.428923 0.254810 0.129652 0.093826 -0.366743 -0.332246 0.010363 -0.661526 -0.658935 0.211386 0.210566 0.258191 0.177286 0.238954 0.214765 0.217358 0.228792 0.189996 0.220355 0.201554 0.209539 0.209533 0.199992 0.202683 0.276168 0.203129 0.268490 0.223106 0.195457 0.250893 0.207017 0.266777 0.195886 0.211524 0.234402 0.215480 0.212381 0.225162 0.203616 0.327707 0.331722
chargesum: 0.00000
title: Mulliken charges with hydrogens summed into heavy atoms:
elementType: O N N N N N N N N C C C C C C C C C C C C C C C C C C
charge: -0.300246 -0.087718 -0.148264 -0.118047 -0.181613 -0.111061 -0.136291 -0.125322 0.072013 0.053339 0.080704 0.068728 0.020752 0.007813 0.034464 0.032473 0.079786 0.076508 -0.010359 0.254810 0.129652 0.093826 0.091168 0.130417 0.010363 -0.000120 -0.017776
polarizability: 3.43396057e+02 -2.60272050e+01 2.55682447e+02 2.08372607e+01 5.38528321e+00 1.96959631e+02
1716.lowfreq: -8.7831 -0.0008 -0.0001 0.0006 0.4627 5.1235 11.6853 17.4034 22.2806
frequency: 11.0238 17.2240 22.1570 29.1890 40.8065 45.2417 52.2134 58.0077 74.6411 85.6302 112.5390 128.6323 143.6742 155.0464 165.1288 194.0130 197.3639 205.0082 217.2776 236.8737 243.5251 258.6788 266.4149 288.5427 312.6903 317.2839 341.3511 350.2000 360.8465 381.5244 390.3897 397.8027 418.8089 437.3672 461.1862 475.0250 484.3961 489.1922 511.6285 535.1261 548.1259 563.8760 575.1191 577.7393 601.8296 630.0915 682.6112 703.3772 713.9809 721.3359 771.4727 776.9260 781.7503 803.6774 803.8772 818.4516 836.1567 843.3654 847.6434 853.1740 897.9409 901.4520 918.8951 930.9109 950.0266 955.6661 961.8795 979.6132 995.8280 1007.4755 1020.4331 1036.0609 1047.2855 1053.1402 1064.5052 1067.7227 1075.5600 1086.0159 1095.2167 1099.1861 1103.3116 1125.5236 1126.2865 1138.6235 1154.3286 1164.0287 1175.8952 1190.6596 1198.6317 1202.7594 1228.7189 1234.4619 1245.1351 1252.7689 1260.0433 1274.8281 1283.0802 1287.8777 1291.9645 1297.2759 1325.8807 1327.2150 1335.8305 1336.5244 1343.6297 1344.8115 1347.4420 1349.3248 1352.1351 1360.6188 1362.0073 1367.3526 1382.5376 1383.5101 1384.8186 1395.9049 1409.6479 1430.6886 1435.3030 1450.3238 1455.0151 1455.4421 1461.0615 1462.5919 1463.5603 1466.3224 1468.3311 1468.6281 1469.5177 1470.9102 1472.6715 1475.4293 1477.6823 1484.3715 1490.2651 1523.9187 1547.8323 1564.1630 1613.0189 2838.5684 2873.1430 2895.4595 2952.0741 2956.0392 2966.5265 2974.2583 2976.6130 2982.9558 2983.7192 2985.8692 2986.3502 2991.7460 3003.2429 3035.1680 3036.8085 3046.0228 3054.5889 3054.8087 3059.3215 3070.5325 3073.0159 3078.8492 3081.0119 3090.2889 3092.6299 3098.3223 3099.0195 3099.2909 3100.1770 3555.8385 3716.7025
redmass: 4.4527 3.8870 4.5342 3.6018 3.0946 3.7871 2.5167 3.7633 5.2588 3.3449 3.5647 3.5372 3.8602 6.6058 2.7786 2.5304 5.3004 1.1327 2.2856 2.0952 2.1499 2.1780 2.7455 2.4831 2.3762 2.2574 3.1991 3.0472 2.4704 2.7498 2.1897 2.3673 2.6208 2.8726 2.6538 1.2348 2.9995 2.2777 4.0826 3.5965 1.0646 3.8466 5.1461 3.6256 2.5484 2.7415 4.0396 5.9133 11.2826 7.8784 2.0752 1.7533 1.3125 2.9272 1.7437 6.9861 1.7050 2.3354 1.4881 2.7111 2.6273 9.7396 2.2575 2.0224 1.3132 2.3000 2.5705 3.2878 2.5871 2.4735 2.4964 2.3258 2.0336 1.9569 2.4358 2.0904 1.9478 1.4824 2.2704 1.9536 2.0997 2.5004 2.3292 2.7645 1.2814 2.3499 2.9924 1.5836 2.5167 1.2904 3.1300 2.3174 1.9957 1.2924 1.7146 1.2182 1.3391 1.4164 1.3976 1.4178 1.3772 1.2777 1.2589 1.3450 1.4552 1.5006 1.3700 1.3470 1.5919 1.3448 1.4231 1.5256 1.2195 1.3291 1.4681 1.8597 2.0292 4.3329 1.1287 1.0911 1.1383 1.1003 1.0897 1.0787 1.1040 1.0865 1.5396 1.5255 1.1290 1.2134 1.1036 1.1137 1.0473 1.0993 1.1187 3.5729 3.7306 7.0238 1.8731 1.0708 1.0696 1.0692 1.0701 1.0703 1.0638 1.0573 1.0455 1.0361 1.0660 1.0611 1.0613 1.0664 1.0665 1.0961 1.0904 1.1026 1.1030 1.0894 1.0971 1.0977 1.0898 1.0956 1.0974 1.1002 1.0968 1.0923 1.0993 1.0979 1.0930 1.0441 1.1058
irintensity: 0.2953 0.3673 0.8216 0.2667 1.2760 0.3408 0.4438 0.0504 4.1224 0.4895 0.1841 1.8411 3.7881 0.8262 3.9096 2.8434 3.6013 0.6874 0.2195 0.9564 0.8477 0.4692 1.9977 0.5074 0.7687 5.1612 3.3386 23.6080 4.7371 1.4394 7.0881 4.8904 6.0325 0.5069 2.7510 263.5920 10.8161 2.6323 21.3148 2.3032 0.2678 12.6882 5.6273 9.2559 1.6988 4.6912 2.2403 5.6736 0.3081 11.1096 13.4790 21.7659 8.3794 3.9193 0.6655 18.3579 1.0448 2.6957 30.0485 2.0054 5.0129 14.8229 46.3620 3.4813 6.4714 40.7464 4.2522 35.7759 68.0037 33.3188 7.6463 8.4551 13.0657 1.0498 12.4893 27.9083 17.5143 1.4942 13.5745 17.3635 24.9128 42.5996 40.1943 38.2339 0.9996 2.8151 8.8577 31.8961 31.9201 21.1982 8.6004 55.2961 251.4265 0.3785 10.1946 12.4682 98.9320 88.9606 18.3206 7.0880 16.4155 2.6309 2.1126 6.3433 10.7014 5.6619 7.8083 1.6069 7.2803 8.8722 9.6000 3.6920 3.7338 29.1483 12.8657 1.6107 355.0207 47.9009 36.6831 8.0484 19.2273 16.2556 22.7613 2.6380 41.1298 20.3169 132.5039 184.1959 35.6384 20.0247 11.5550 25.5138 0.7760 27.3173 61.3514 488.2170 871.6312 238.0067 325.7759 74.2563 61.6846 105.5982 15.2198 88.6208 53.7311 41.2452 42.1530 37.9623 35.2436 34.5078 30.3686 49.5623 39.5074 70.5522 46.8772 32.4257 91.4254 11.9983 17.0081 2.7131 13.4360 49.7392 38.0828 30.3251 39.3188 5.3952 33.4005 7.8538 6.2899 91.8201 43.4436
temp: 298.150 k
press: 1.00000 atm
elementType: 8 7 7 7 7 7 7 7 7 6 6 6 6 6 6 6 6 6 6 6 6 6 6 6 6 6 6 1 1 1 1 1 1 1 1 1 1 1 1 1 1 1 1 1 1 1 1 1 1 1 1 1 1 1 1 1 1 1 1
symmnumber: 1
zpe: 1329496.6 jmol-1
zpe.correction: 0.506379 hartree
zpe.thermalcorrener: 0.533938 hartree
zpe.thermalcorrenthalpy: 0.534883 hartree
zpe.thermalcorrgfe: 0.444713 hartree
zpe.sumelectzpe: -1216.269154 hartree
zpe.sumelectthermal: -1216.241594 hartree
zpe.sumelectthermalent: -1216.240650 hartree
zpe.sumelectthermalfe: -1216.330819 hartree
dipole: 3.6498 3.2256 2.7515
dipole: 5.5943
quadrupole: -144.8247 -150.9992 -162.6713
quadrupole: -15.1306 -7.8563 -1.1221
quadrupole: 8.0070 1.8325 -9.8396 -15.1306 -7.8563 -1.1221
hfenergy: -1216.7755323 hartree
pointgroup: C01 [X(C18H32N8O1)]
dipole: 1.4946322 -0.394807 1.5666811 debye
polarizability: 332.6778064|-45.1083446|218.7475715|-12.9181087|28.3281992|244.6127577 unknown
InChI: InChI=1S/C18H32N8O/c1-3-24(4-2)18(27)26-12-10-23(11-13-26)14-15-20-16(19)22-17(21-15)25-8-6-5-7-9-25/h3-14,19H2,1-2H3
charge 0 multiplicity 1
59 atoms
O  -5.181509 0.336087 -1.636495
N  -0.74587 0.1122 -0.726299
N  -3.516417 -0.585522 -0.265054
N  4.553807 -1.445293 -0.069088
N  -5.557793 0.206476 0.688501
N  2.562777 -0.281137 -0.588083
N  3.686898 0.027954 1.558285
N  1.622664 1.239513 1.052927
N  2.738204 1.518101 3.094295
C  -1.655814 -0.128749 -1.875721
C  -1.492255 0.706372 0.408459
C  -2.783502 -1.08964 -1.448196
C  -2.62695 -0.234611 0.868795
C  7.097111 -2.19574 -1.278494
C  5.872733 -1.809657 -2.14366
C  7.033174 -1.496824 0.101279
C  4.549201 -2.097227 -1.396389
C  5.690497 -1.792174 0.809348
C  0.464865 0.892188 -1.099576
C  -4.774924 0.008868 -0.471444
C  3.584553 -0.54883 0.310739
C  1.620226 0.601242 -0.158195
C  -5.641218 -0.826191 1.753717
C  -6.723691 1.115622 0.575772
C  2.688157 0.904163 1.867795
C  -6.513508 -2.039201 1.351636
C  -6.620729 2.318595 1.536408
H  -1.077957 -0.59076 -2.697243
H  -2.112566 0.818732 -2.256533
H  -0.790186 0.883961 1.24123
H  -1.93725 1.695742 0.121939
H  -3.504812 -1.214189 -2.271272
H  -2.336678 -2.068908 -1.187475
H  -2.181884 -1.157909 1.290222
H  -3.212486 0.276885 1.649028
H  7.107069 -3.296036 -1.129953
H  8.03662 -1.934564 -1.801068
H  5.877598 -2.371417 -3.097392
H  5.917025 -0.731833 -2.394429
H  7.138655 -0.401973 -0.028303
H  7.865436 -1.834953 0.748171
H  4.435415 -3.192888 -1.250865
H  3.673641 -1.726158 -1.94959
H  5.630501 -2.874784 1.052134
H  5.583511 -1.218167 1.741615
H  0.778479 0.581989 -2.110025
H  0.267916 1.991063 -1.10619
H  -4.633831 -1.186283 2.014626
H  -6.054118 -0.34246 2.659519
H  -6.771036 1.454522 -0.472397
H  -7.657493 0.550876 0.773803
H  -6.571074 -2.765133 2.184332
H  -6.076582 -2.550463 0.475755
H  -7.543027 -1.73305 1.093349
H  -7.510344 2.968496 1.436134
H  -5.723483 2.91945 1.305648
H  -6.555409 1.995931 2.592566
H  3.505702 1.308524 3.726849
H  2.011764 2.186178 3.337651
