program: Gaussian 09
title: 000216240
version: EM64L-G09RevD.01
frameworkgroup: C1[X(C7H11NO2)]
method: RPBEPBE
basis: SDD
operation: Freq
keyword: #p
keyword: freq=noraman
keyword: PBEPBE/SDD
title: #p freq=noraman PBEPBE/SDD
converged: YES YES NO NO
title: Mulliken charges:
elementType: O O N C C C C C C C H H H H H H H H H H H
charge: -0.416558 -0.234869 -0.576214 -0.196444 -0.151863 -0.602707 -0.624713 0.600254 0.130333 -0.784220 0.260613 0.253933 0.235211 0.245135 0.232796 0.253293 0.277612 0.278793 0.227492 0.221039 0.371084
chargesum: 0.00000
title: Mulliken charges with hydrogens summed into heavy atoms:
elementType: O O N C C C C C C C
charge: -0.045474 -0.234869 -0.019809 0.064169 0.102070 -0.122361 -0.138624 0.600254 0.130333 -0.335689
polarizability: 1.10139992e+02 -5.99255230e+00 7.65735169e+01 3.65642993e+00 9.35469339e-01 7.07845501e+01
1716.lowfreq: -20.5398 -3.9372 0.0006 0.0008 0.0009 11.1822 22.5108 36.7120 117.8547
frequency: 10.7880 34.0992 117.7628 145.3460 227.9969 267.9029 291.3060 359.1792 397.1057 407.6416 459.6764 528.2755 544.0146 549.4687 628.4970 653.5176 683.2715 716.9672 774.1852 830.0135 841.9290 918.1339 926.4401 959.7332 968.1994 988.8037 1016.3747 1063.6525 1119.4579 1144.6227 1150.9093 1184.2097 1220.7263 1239.1755 1255.6879 1276.7635 1286.5540 1296.9259 1359.0088 1390.8019 1429.6917 1445.0662 1448.5464 1637.9997 1652.9422 1685.5192 2964.7052 3002.4838 3003.2550 3055.2688 3068.3432 3078.7186 3088.1218 3189.1870 3473.5172 3499.8790 3604.9838
redmass: 3.5270 8.5144 2.5743 4.4551 3.1803 1.7587 1.4107 5.0214 2.3323 2.1103 2.4328 4.1598 1.6104 3.2500 1.2574 1.5829 2.0807 4.1668 2.3703 3.7165 3.1993 1.3898 1.6490 1.5537 1.8553 2.6844 3.1241 1.9275 1.3620 1.3255 2.1643 1.2902 1.6344 1.5179 1.6861 1.3996 2.0118 1.3109 1.6130 1.6788 1.1688 1.0797 1.0968 1.1066 7.2394 6.2915 1.0684 1.0851 1.0608 1.0986 1.0902 1.0948 1.0628 1.1139 1.0449 1.0638 1.0987
irintensity: 0.1576 0.9215 1.6979 0.8933 2.7633 16.8779 46.1067 18.9461 47.2102 9.5652 22.8331 19.1161 230.0370 83.8748 119.3518 6.1390 11.9959 2.8265 1.3524 5.7165 1.4581 55.7116 16.2916 7.5870 22.4262 43.6452 142.7475 170.9367 4.9321 10.5997 38.4259 1.5300 21.7136 4.1195 14.0838 4.4209 15.9566 4.3674 14.9004 42.7500 2.5661 20.2922 11.4876 48.6880 179.3513 26.0228 11.0577 31.9414 18.5202 5.9451 21.0019 19.6645 10.0996 18.2555 2.3348 19.3119 3.2220
temp: 298.150 k
press: 1.00000 atm
elementType: 8 8 7 6 6 6 6 6 6 6 1 1 1 1 1 1 1 1 1 1 1
symmnumber: 1
zpe: 451969.2 jmol-1
zpe.correction: 0.172146 hartree
zpe.thermalcorrener: 0.182556 hartree
zpe.thermalcorrenthalpy: 0.183500 hartree
zpe.thermalcorrgfe: 0.134422 hartree
zpe.sumelectzpe: -477.749488 hartree
zpe.sumelectthermal: -477.739078 hartree
zpe.sumelectthermalent: -477.738134 hartree
zpe.sumelectthermalfe: -477.787212 hartree
dipole: -1.3614 0.3200 -1.3929
dipole: 1.9738
quadrupole: -53.2569 -63.2454 -61.1569
quadrupole: -1.0682 -1.9771 2.8942
quadrupole: 5.9629 -4.0257 -1.9372 -1.0682 -1.9771 2.8942
hfenergy: -477.9216337 hartree
pointgroup: C01 [X(C7H11N1O2)]
dipole: -0.5379266 -0.1953777 0.5249039 debye
dipolederiv: -1.2470697 -0.0518322 0.3596458 -0.0836008 -0.3254721 -0.0423141 0.2428669 -0.0433253 -0.3501186 -0.665289 0.0611478 -0.0294745 -0.0711871 -0.4807615 0.2556647 0.128538 0.3602158 -0.7338036 -0.5078087 -0.0838143 -0.0660988 -0.0628502 -0.9808044 -0.2546337 -0.021981 -0.3466424 -0.2782117 -0.2540728 0.2313358 -0.092213 0.163736 -0.4982704 -0.0297424 -0.0986894 -0.0349427 0.0039504 0.509448 0.1827747 0.126379 -0.04573 0.8794686 0.1550047 -0.0620683 0.3489958 0.2458706 0.1076455 0.0183888 0.077533 0.0843773 0.0071934 -0.0910157 0.0537854 -0.067827 0.0399253 -0.0812166 -0.1013262 0.065532 -0.0661154 -0.0558541 -0.1059224 0.0295338 -0.0867007 0.0079371 0.3394932 0.0401574 -0.0691074 0.0012644 0.1485051 0.1637937 -0.0268181 0.1942365 0.0877389 1.6440521 -0.232689 -0.2085798 -0.0142746 0.4036608 -0.4082087 -0.1130226 -0.6482086 0.8141082 -0.3442409 -0.0038522 -0.0482857 0.0107814 -0.1579917 0.2458596 -0.0515214 0.2365127 -0.2334959 -0.0170101 -0.003285 0.0699631 -0.0199288 0.0846665 0.0197467 0.0663336 0.0230657 -0.0666161 0.006091 0.061135 -0.060899 0.0549302 -0.0547789 0.066516 -0.0551517 0.0397675 -0.0960462 -0.0369793 -0.00063 -0.0566644 -0.0067377 0.0941384 0.0031712 -0.0227844 -0.0368919 -0.11646 0.0146744 0.0240722 0.0149383 0.0268894 -0.0873915 -0.0041175 0.0380909 0.0593313 0.0878325 0.0036318 -0.0205915 -0.1127585 -0.0436188 0.0464791 0.0516755 -0.1001925 0.0248578 -0.0482686 -0.0280123 0.1050926 0.0423869 0.0580042 -0.0467812 -0.0602858 0.047595 -0.0477192 0.076254 0.1693173 -0.0647908 -0.0721078 0.0017643 0.2512264 0.1799231 -0.0627897 0.1129853 0.1216308 0.0430105 -0.1434468 0.0412313 0.0032608 0.4090946 -0.0082872 0.0491082 0.0263495 0.1112553 0.0046206 0.0241237 0.0778785 0.0529359 0.0587248 -0.1208391 0.1151136 -0.10605 0.0662166 0.0429099 -0.0674262 -0.0037625 -0.095243 -0.0039387 -0.1246412 -0.043273 -0.1395631 0.0842714 0.2968052 0.0254564 -0.0555366 0.0513423 0.3088868 0.1086528 -0.1126732 0.1315529 0.1760296 unknown
polarizability: 110.2177651|6.2521671|76.1580081|-2.7160212|1.699142|71.1222856 unknown
InChI: InChI=1S/C7H11NO2/c1-4-2-5(7(9)10)6(8)3-4/h5-6,9H,1-3,8H2
charge 0 multiplicity 1
21 atoms
O  -2.808331 0.572916 0.401857
O  -1.258355 1.369713 -1.128884
N  -1.073101 -2.123632 -0.387137
C  -0.487778 0.124646 0.86993
C  -0.059656 -1.307078 0.263033
C  0.853139 0.910253 0.950343
C  1.106641 -0.941119 -0.685931
C  1.837805 0.1920 0.014362
C  -1.490715 0.772037 -0.051351
C  3.145218 0.513031 -0.132885
H  -0.966908 -0.014792 1.852705
H  0.339339 -1.873389 1.126892
H  1.232394 0.911615 1.988757
H  0.722233 1.965287 0.649316
H  0.682682 -0.575072 -1.645081
H  1.74671 -1.810062 -0.909275
H  -1.386137 -1.787324 -1.302111
H  -1.837367 -2.455146 0.205438
H  3.803161 -0.046882 -0.806986
H  3.596877 1.351453 0.411178
H  -3.438952 0.983744 -0.25147
