program: Gaussian 09
title: 000210924
version: EM64L-G09RevD.01
frameworkgroup: C1[X(C11H11NO3S)]
method: RPBEPBE
basis: SDD
operation: Freq
keyword: #p
keyword: freq=noraman
keyword: PBEPBE/SDD
title: #p freq=noraman PBEPBE/SDD
converged: YES YES NO NO
title: Mulliken charges:
elementType: S O O O N C C C C C C C C C C C H H H H H H H H H H H
charge: 0.165308 -0.381833 -0.160879 -0.168243 -0.589441 -0.351563 0.262876 0.231006 -0.000355 0.079518 -0.358532 -0.360985 -0.612819 -0.208956 -0.206237 -0.347285 0.288682 0.265425 0.277642 0.278544 0.378330 0.242747 0.242454 0.211212 0.260255 0.280076 0.283050
chargesum: 0.00000
title: Mulliken charges with hydrogens summed into heavy atoms:
elementType: S O O O N C C C C C C C C C C C
charge: 0.165308 -0.003503 -0.160879 -0.168243 -0.026314 -0.351563 0.262876 0.231006 -0.000355 0.079518 -0.080890 -0.082441 -0.058711 0.033791 0.036217 0.124183
polarizability: 2.44922617e+02 -1.71994914e+00 1.56957437e+02 7.02019206e+00 -4.01180323e+00 9.61196544e+01
1716.lowfreq: -7.8536 -0.0018 -0.0017 -0.0012 6.8746 11.3645 31.6292 43.2879 73.3711
frequency: 30.0856 43.2160 73.2706 87.9602 114.3137 135.4413 158.4485 160.9339 192.4349 218.2269 234.0203 238.4675 253.7718 289.6950 331.7631 381.7316 407.7753 410.1007 442.4441 450.1757 519.5173 536.5754 536.8665 579.8467 653.2125 669.5660 689.2160 696.9335 753.9230 758.4885 796.8439 822.1603 849.0769 909.4079 928.8375 931.4659 971.4280 982.0098 1011.1761 1014.8647 1034.9177 1080.1332 1089.5274 1100.9695 1129.4102 1174.3301 1182.1808 1224.0691 1244.0044 1282.2897 1283.9685 1315.7445 1329.8468 1370.4552 1407.8562 1429.7295 1452.0550 1453.5211 1486.8006 1591.9467 1597.4433 1626.3182 1635.1953 1653.1533 2967.3703 3026.7173 3049.9560 3106.9256 3139.3195 3153.1891 3164.9810 3174.1795 3495.4514 3497.6583 3629.7358
redmass: 4.5600 5.9102 6.2169 2.0519 4.1593 6.3511 1.1234 9.3486 4.8486 3.5193 4.2874 6.0904 4.5899 5.9202 6.8294 4.5994 3.9557 1.5485 4.4757 4.5973 7.3008 1.3674 8.2694 7.6831 4.9449 5.2074 6.2257 6.6128 1.3335 1.4665 3.8989 3.2880 5.6875 1.4651 1.4435 8.5438 3.8348 1.4310 1.3638 2.0782 3.1358 2.4327 1.4536 2.5219 3.3089 1.1479 2.0279 1.3191 3.1197 1.4173 1.4443 1.1142 1.7266 1.3117 7.2849 1.0875 2.6260 2.5054 1.0810 7.7694 7.4556 9.1956 1.1136 11.7923 1.0650 1.0576 1.0981 1.1075 1.0866 1.0904 1.0956 1.1004 1.0649 1.0449 1.0997
irintensity: 1.4973 3.5642 2.0619 0.5600 1.3615 0.8955 84.8099 1.8497 2.6755 1.1715 9.7761 0.6573 19.2513 3.2188 7.1723 46.5708 0.2998 122.2133 14.7580 3.0207 2.8490 251.4149 12.6829 77.4465 4.5282 25.3657 19.9578 3.4062 1.8453 36.8176 2.8623 36.9856 26.9538 0.4101 1.3779 140.2459 20.4712 5.8754 0.0146 4.0167 6.0954 2.0934 14.9838 55.5226 89.6470 13.5842 1.9163 14.6342 130.4739 12.5070 3.3959 0.7837 84.0572 6.1660 24.4823 11.8751 2.6286 2.6213 5.1188 164.0280 1.9107 162.1698 30.8453 76.6692 25.6255 12.3063 22.3378 9.2568 1.8648 5.1289 4.3790 22.2828 32.4894 4.0749 4.6816
temp: 298.150 k
press: 1.00000 atm
elementType: 16 8 8 8 7 6 6 6 6 6 6 6 6 6 6 6 1 1 1 1 1 1 1 1 1 1 1
symmnumber: 1
zpe: 525442.0 jmol-1
zpe.correction: 0.200130 hartree
zpe.thermalcorrener: 0.216005 hartree
zpe.thermalcorrenthalpy: 0.216950 hartree
zpe.thermalcorrgfe: 0.156220 hartree
zpe.sumelectzpe: -1103.071534 hartree
zpe.sumelectthermal: -1103.055659 hartree
zpe.sumelectthermalent: -1103.054715 hartree
zpe.sumelectthermalfe: -1103.115444 hartree
dipole: -2.1666 -1.2383 -0.5770
dipole: 2.5613
quadrupole: -70.6681 -103.4408 -106.1245
quadrupole: 8.0569 5.5499 1.7142
quadrupole: 22.7431 -10.0296 -12.7134 8.0569 5.5499 1.7142
hfenergy: -1103.2716644 hartree
pointgroup: C01 [X(C11H11N1O3S1)]
dipole: 0.8497754 0.5386636 -0.0563585 debye
polarizability: 245.1618336|0.6916898|149.5160627|-4.3354717|20.3108475|103.3218119 unknown
InChI: InChI=1S/C11H11NO3S/c12-5-6-16-11(15)9(13)7-3-1-2-4-8(7)10(11)14/h1-4,15H,5-6,12H2
charge 0 multiplicity 1
27 atoms
S  -1.569896 -0.39266 -1.540755
O  -1.481219 -1.572379 1.040918
O  0.682042 -2.755127 -0.578569
O  -0.890728 1.352458 1.385714
N  -5.171909 0.987106 0.076509
C  -0.686461 -0.808499 0.133058
C  1.721599 -0.536035 -0.228777
C  1.242323 0.664393 0.364694
C  0.620947 -1.531255 -0.296465
C  -0.202451 0.530133 0.730181
C  3.066422 -0.66691 -0.628047
C  2.098668 1.762323 0.572304
C  -2.97059 0.76142 -0.964553
C  3.927647 0.436918 -0.425985
C  3.449212 1.636844 0.168743
C  -4.129183 0.009291 -0.277756
H  -2.53424 1.517605 -0.29025
H  -3.317316 1.258334 -1.886719
H  3.423609 -1.59709 -1.08058
H  1.721495 2.67854 1.037014
H  -1.551853 -2.495634 0.673764
H  4.978882 0.369239 -0.725909
H  4.140834 2.472939 0.318757
H  -4.557527 -0.723353 -0.985755
H  -3.725479 -0.557933 0.586215
H  -4.984137 1.540882 0.914876
H  -6.137291 0.66255 0.010375
