program: Gaussian 09
title: 000210916
version: EM64L-G09RevD.01
frameworkgroup: C1[X(C9H17NO)]
method: RPBEPBE
basis: SDD
operation: Freq
keyword: #p
keyword: freq=noraman
keyword: PBEPBE/SDD
title: #p freq=noraman PBEPBE/SDD
converged: YES YES NO NO
title: Mulliken charges:
elementType: O N C C C C C C C C C H H H H H H H H H H H H H H H H H
charge: -0.302005 -0.325184 0.293320 -0.461676 0.014675 -0.476377 -0.419868 -0.399905 -0.502426 -0.289645 -0.754559 0.201972 0.215426 0.231455 0.209495 0.200092 0.197929 0.183181 0.189436 0.227759 0.260536 0.233966 0.234417 0.206645 0.198508 0.213002 0.213501 0.206331
chargesum: 0.00000
title: Mulliken charges with hydrogens summed into heavy atoms:
elementType: O N C C C C C C C C C
charge: -0.302005 -0.064648 0.293320 -0.044278 0.246130 -0.066790 -0.038758 0.017290 -0.034043 0.115508 -0.121725
polarizability: 1.16655389e+02 -1.74043188e+00 1.00204949e+02 7.44476125e-01 -1.42350800e+00 8.90657729e+01
1716.lowfreq: -18.8810 -0.0011 -0.0010 -0.0008 2.4743 21.2297 30.7063 111.4334 125.7139
frequency: 29.7745 111.3852 125.7106 170.7550 200.6793 238.3497 283.2221 298.2379 319.4439 401.8047 415.2392 439.2538 476.2046 510.7680 620.5037 643.8369 708.3107 751.2518 775.8568 826.6704 845.0510 855.2300 879.9391 893.5148 914.2955 936.7213 957.7562 970.6398 979.0320 1021.6874 1055.9118 1073.5194 1085.8863 1102.1891 1135.9828 1146.1060 1155.7479 1167.9988 1187.9461 1217.3841 1247.5220 1254.6678 1283.7897 1292.7191 1307.6254 1310.3119 1314.7277 1338.2709 1344.6985 1349.8289 1364.1511 1383.7184 1437.5946 1442.3527 1450.5068 1463.0221 1469.1340 1472.9837 1475.1403 1476.3526 1491.2479 2950.1368 2963.1651 2971.9451 2976.0174 2977.1307 2984.1921 2991.1771 3020.8516 3021.5620 3032.4282 3038.0208 3041.3611 3053.8430 3058.8351 3063.4740 3092.5036 3407.0912
redmass: 2.4812 2.8023 3.1450 2.3187 1.0514 2.2391 2.3251 2.5373 2.5399 3.5238 1.7695 3.3666 2.5494 2.3960 3.2500 2.3551 6.6560 1.7354 1.9483 2.1609 1.5231 1.6931 1.7607 2.3737 2.6101 1.9883 3.1612 1.8930 1.4853 2.5342 1.5756 2.0852 1.7649 1.4753 2.1923 1.7795 1.4004 2.1165 1.4293 1.5780 1.4005 1.3928 1.5230 1.3714 1.1983 1.3559 1.3430 1.4351 1.5180 1.6582 1.6399 1.2236 1.2321 1.1126 1.1024 1.0867 1.0897 1.0492 1.0830 1.0603 1.0830 1.0631 1.0364 1.0612 1.0604 1.0620 1.0738 1.0641 1.0805 1.0874 1.1014 1.0992 1.0985 1.1026 1.0992 1.0991 1.1061 1.0745
irintensity: 4.2916 0.9535 2.4253 1.0934 0.1258 1.0314 2.5051 0.7961 1.2548 1.9117 6.2560 1.6233 18.8825 4.3268 16.4379 4.0527 25.8154 135.8374 2.8012 8.9315 5.3777 11.0419 14.4094 10.6438 3.7661 6.4440 27.6406 18.7740 1.1351 3.1427 9.7617 5.4478 13.8893 5.4212 12.4389 0.4053 8.9511 7.5459 9.4732 6.2526 13.1933 7.0694 0.4236 16.3696 0.4799 3.2503 5.8821 0.5742 6.5614 7.5098 17.4837 8.8802 12.1404 9.9220 3.6638 11.9671 9.6588 16.2534 14.2394 3.4915 0.3084 32.3973 46.6456 19.5673 65.6651 59.2527 28.5777 27.1498 0.6433 81.7318 23.5867 49.3141 29.7073 15.1395 115.7494 48.4815 37.4241 2.3768
temp: 298.150 k
press: 1.00000 atm
elementType: 8 7 6 6 6 6 6 6 6 6 6 1 1 1 1 1 1 1 1 1 1 1 1 1 1 1 1 1
symmnumber: 1
zpe: 655218.0 jmol-1
zpe.correction: 0.249559 hartree
zpe.thermalcorrener: 0.260483 hartree
zpe.thermalcorrenthalpy: 0.261427 hartree
zpe.thermalcorrgfe: 0.212988 hartree
zpe.sumelectzpe: -482.226091 hartree
zpe.sumelectthermal: -482.215167 hartree
zpe.sumelectthermalent: -482.214223 hartree
zpe.sumelectthermalfe: -482.262663 hartree
dipole: 1.2964 0.0722 -0.3457
dipole: 1.3437
quadrupole: -61.2107 -65.9696 -73.4531
quadrupole: -0.7560 0.8508 -2.5443
quadrupole: 5.6671 0.9082 -6.5753 -0.7560 0.8508 -2.5443
hfenergy: -482.4756506 hartree
pointgroup: C01 [X(C9H17N1O1)]
dipole: 0.5112982 0.0253163 -0.1318619 debye
polarizability: 116.6146833|-1.8608591|100.2501423|0.9364665|-1.3739465|89.0612853 unknown
InChI: InChI=1S/C9H17NO/c1-8-3-2-4-9(7-8)10-5-6-11-9/h8,10H,2-7H2,1H3
charge 0 multiplicity 1
28 atoms
O  1.040371 0.206204 1.120589
N  1.815444 0.208018 -1.138466
C  0.589694 0.359611 -0.339462
C  -0.4384 -0.753509 -0.639105
C  -1.712943 -0.624245 0.231689
C  -0.033691 1.757286 -0.483252
C  -2.332214 0.785678 0.056639
C  -1.309656 1.901079 0.377484
C  2.661233 -0.76628 -0.394769
C  2.352362 -0.478067 1.111782
C  -2.726645 -1.738332 -0.102457
H  0.0286 -1.744675 -0.482215
H  -0.710419 -0.685047 -1.711919
H  -1.398779 -0.72603 1.29093
H  -0.279969 1.917052 -1.55232
H  0.71688 2.516325 -0.187402
H  -3.220374 0.887705 0.711048
H  -2.689558 0.895474 -0.99025
H  -1.760455 2.898244 0.210479
H  -1.023622 1.841149 1.444786
H  2.296044 1.116275 -1.233974
H  3.724419 -0.631415 -0.652985
H  2.370123 -1.795482 -0.665757
H  2.287737 -1.40395 1.713327
H  3.103231 0.198108 1.565655
H  -2.287209 -2.742206 0.050633
H  -3.628508 -1.662877 0.533901
H  -3.053398 -1.671391 -1.158808
