program: Gaussian 09
title: 000210912
version: EM64L-G09RevD.01
frameworkgroup: C1[X(C10H15N)]
method: RPBEPBE
basis: SDD
operation: Freq
keyword: #pfreq=noraman
keyword: PBEPBE/SDD
title: #p freq=noraman PBEPBE/SDD
converged: YES YES NO NO
title: Mulliken charges:
elementType: N C C C C C C C C C C H H H H H H H H H H H H H H H
charge: -0.560653 -0.200752 -0.128890 0.525545 -0.721606 -0.703705 -0.398299 -0.456890 -0.245671 -0.223576 -0.247782 0.187207 0.206364 0.214372 0.203294 0.258639 0.238997 0.199251 0.206554 0.251160 0.267867 0.228362 0.230181 0.221726 0.222454 0.225851
chargesum: 0.00000
title: Mulliken charges with hydrogens summed into heavy atoms:
elementType: N C C C C C C C C C C
charge: -0.041625 -0.013545 0.077474 0.525545 -0.045301 -0.058903 -0.169937 -0.226709 -0.023945 -0.001122 -0.021931
polarizability: 1.42359243e+02 -8.89758809e+00 8.31008670e+01 -2.28964703e+00 -7.52128083e+00 1.05784112e+02
1716.lowfreq: -13.7770 -2.3637 -0.0009 -0.0005 0.0001 13.1491 45.9322 62.2542 95.0284
frequency: 45.1304 62.1844 95.0233 197.1671 204.6295 207.3909 219.6070 246.4276 299.2290 334.7720 384.1129 404.9915 415.5119 477.3837 541.9060 603.6304 616.1002 662.9527 706.0526 758.9848 777.2071 819.2221 851.9071 912.4767 916.3862 965.2537 973.4624 984.9915 991.1235 993.5409 1024.3623 1042.7033 1056.9549 1081.8598 1105.5526 1152.7885 1170.1734 1182.9870 1188.1286 1219.2852 1286.8017 1288.9165 1313.0915 1340.7853 1361.0785 1378.6492 1381.2139 1384.1112 1440.4391 1463.2992 1464.1372 1474.8012 1481.7159 1485.8785 1590.8691 1611.8800 1635.6258 2948.8407 2965.7311 2980.1502 2987.7165 3060.1023 3071.7395 3077.6607 3099.8147 3113.6526 3115.0111 3130.6066 3140.9343 3160.3002 3420.3228 3546.8993
redmass: 3.3955 2.9196 3.5433 1.3652 2.0631 1.1162 1.3773 1.6254 2.9213 3.8774 2.3938 2.8094 2.4665 2.5234 2.9524 4.1579 6.3540 1.5443 1.6573 2.1402 2.4405 2.2843 1.2489 1.7042 1.4843 1.2204 1.3907 2.1744 1.8145 1.9845 2.0703 2.2455 1.5606 1.7886 2.6627 2.1559 1.0757 1.5293 1.1317 2.2150 1.5687 1.4931 1.3040 1.3378 1.3047 1.3689 1.2379 3.4272 2.1297 1.0547 1.0831 1.0581 1.7244 1.1951 5.9035 6.1272 1.0937 1.0818 1.0368 1.0368 1.0843 1.0989 1.0987 1.0989 1.0998 1.0850 1.0873 1.0909 1.0959 1.1014 1.0450 1.0958
irintensity: 0.1523 0.3162 0.5593 33.6433 7.5317 3.1953 11.0917 1.4963 0.2672 14.2666 3.6426 0.0157 2.2653 18.6244 19.6505 2.5072 0.6939 197.0644 60.2751 22.1849 23.2558 3.3942 0.0220 1.3001 4.4451 7.2817 0.6562 4.7569 0.2094 4.1330 11.0913 4.4011 21.1121 10.1785 11.0989 29.5700 0.2463 3.7111 0.9611 0.1889 0.3432 2.7818 2.2364 0.6319 5.7976 22.8759 9.7861 5.8544 7.5143 3.3558 6.7531 12.0151 12.0998 16.2199 1.2791 9.1923 35.3193 16.1889 27.7691 24.2671 40.6143 39.7568 43.4630 44.3085 15.9691 11.4809 3.6976 12.3597 49.7885 24.6543 2.7110 0.2096
temp: 298.150 k
press: 1.00000 atm
elementType: 7 6 6 6 6 6 6 6 6 6 6 1 1 1 1 1 1 1 1 1 1 1 1 1 1 1
symmnumber: 1
zpe: 592727.7 jmol-1
zpe.correction: 0.225758 hartree
zpe.thermalcorrener: 0.237357 hartree
zpe.thermalcorrenthalpy: 0.238301 hartree
zpe.thermalcorrgfe: 0.188397 hartree
zpe.sumelectzpe: -443.966924 hartree
zpe.sumelectthermal: -443.955325 hartree
zpe.sumelectthermalent: -443.954381 hartree
zpe.sumelectthermalfe: -444.004285 hartree
dipole: -0.5765 -1.3439 -0.0183
dipole: 1.4624
quadrupole: -62.1290 -72.1653 -61.8453
quadrupole: 3.6652 -0.4600 -1.9834
quadrupole: 3.2509 -6.7855 3.5346 3.6652 -0.4600 -1.9834
hfenergy: -444.1926816 hartree
pointgroup: C01 [X(C10H15N1)]
dipole: -0.2313565 0.3882428 -0.3560663 debye
dipolederiv: -0.7303455 -0.1811275 0.0717246 -0.1391877 -0.4863096 0.258513 0.1201782 0.2505239 -0.3351445 0.0027387 -0.0049163 0.0434436 0.0631079 0.0610085 0.0515303 0.1269533 0.0810488 0.1286103 0.6421323 0.0893142 -0.008039 -0.0857174 0.2815012 -0.1201111 0.0402017 -0.0857872 0.255553 0.3535332 0.0611568 -0.0109058 0.1241345 -0.0555754 0.0093895 -0.0082322 0.0026992 -0.0661029 -0.1267015 -0.0139649 0.0009863 -0.0055774 -0.0048903 0.0895322 -0.0221474 0.0537231 0.0180467 -0.0547034 -0.0283974 -0.0082278 -0.0440687 -0.0936379 0.1477241 0.0627022 0.1415081 -0.017213 -0.1472534 -0.0094988 -0.0580651 -0.0549714 -0.1354709 0.0613881 -0.146026 0.0442255 -0.0023844 -0.1880911 0.0181489 0.0247996 0.0425013 -0.1020395 0.0926485 0.0640145 0.1072563 0.0163743 0.0170604 0.0466288 0.0161651 0.0690348 -0.0820203 0.1095065 0.038524 0.1180797 0.0570912 0.0350753 0.0041653 -0.0721647 -0.0018135 -0.0979135 0.0777838 -0.0915459 0.072778 0.0490307 0.03879 0.0598991 -0.0023486 0.0531931 -0.1484012 0.03327 -0.001172 0.0325989 -0.1134022 0.0113176 -0.0076077 -0.0163498 -0.0169167 0.0037036 -0.050221 -0.0647431 -0.0833347 -0.161098 0.0212522 -0.0211724 -0.0226788 -0.0275091 0.00133 -0.0505083 -0.020724 -0.0740092 -0.1433069 0.0355603 0.1474229 -0.0016695 0.1134078 -0.1157924 0.0243885 0.0080115 -0.0140052 0.057178 0.0912433 -0.0192916 -0.0605139 -0.0193366 0.0217623 -0.121708 -0.0531813 -0.0459885 -0.1029095 -0.0876661 -0.1181411 0.0367008 -0.1105614 0.097707 -0.0053994 0.0414038 -0.0046541 0.0933651 -0.1229683 -0.1206002 0.0043748 -0.1366687 0.0536235 -0.0059638 -0.0014069 -0.0150043 0.0572737 0.0850506 -0.0074789 -0.0017026 -0.0272503 0.0141054 -0.1350594 -0.0055912 -0.0510695 -0.1142916 -0.064134 0.1590335 -0.0142824 0.1481518 -0.0908206 0.0346947 0.013417 0.0063413 0.0665286 0.1575237 0.0230944 0.0232417 0.0145015 0.2756833 -0.0687785 -0.0772368 -0.1305521 0.0057012 0.0671621 0.0743819 -0.0362857 0.1950032 0.0761521 -0.0783829 -0.1429638 -0.0514298 0.2515745 0.0082041 0.0212275 0.1167572 0.0199719 0.115951 -0.0443505 0.1175369 -0.0478678 -0.0073931 0.0512325 -0.0660379 -0.0789728 -0.0535612 0.0767503 -0.0982451 -0.0536032 -0.0952359 -0.0241861 0.0445406 -0.051295 -0.051505 -0.0646593 0.0809582 -0.1128529 -0.0689384 -0.1149204 -0.040982 -0.0108559 0.0159425 0.1051658 0.0196678 0.1244294 -0.068131 0.1229903 -0.0662476 -0.03022 -0.129698 -0.0708861 0.0003519 -0.0748763 0.1282058 -0.0306574 0.0015788 -0.0306765 0.1023069 unknown
polarizability: 141.9931934|9.5809249|86.4667688|-3.8248698|10.6799887|102.7842597 unknown
InChI: InChI=1S/C10H15N/c1-8(9(2)11)10-6-4-3-5-7-10/h3-9H,11H2,1-2H3
charge 0 multiplicity 1
26 atoms
N  -3.534353 0.019251 -0.137364
C  -1.165739 -0.72231 -0.055406
C  -2.134861 0.508582 -0.027444
C  0.306708 -0.309212 -0.014715
C  -1.497977 -1.719312 1.085008
C  -1.775173 1.559687 -1.111487
C  0.838713 0.394211 1.099488
C  1.183826 -0.631768 -1.080915
C  2.200057 0.765775 1.143045
C  2.549674 -0.266537 -1.0417
C  3.063705 0.436427 0.071246
H  -1.344278 -1.240365 -1.023415
H  -2.046715 0.983983 0.970901
H  -0.904338 -2.645799 0.984043
H  -1.267492 -1.279013 2.073287
H  -2.573493 -1.960929 1.062612
H  -0.759791 1.970846 -0.970982
H  -1.818117 1.102046 -2.11973
H  -2.494905 2.399438 -1.087241
H  -3.733085 -0.391001 -1.059419
H  -4.232343 0.733968 0.098627
H  0.184325 0.650968 1.941819
H  0.792366 -1.176758 -1.949273
H  2.58965 1.309435 2.011672
H  3.209226 -0.529491 -1.876871
H  4.121109 0.722179 0.105417
