program: Gaussian 09
title: 000210910
version: EM64L-G09RevD.01
frameworkgroup: C1[X(C12H18ClN)]
method: RPBEPBE
basis: SDD
operation: Freq
keyword: #p
keyword: freq=noraman
keyword: PBEPBE/SDD
title: #p freq=noraman PBEPBE/SDD
converged: YES YES NO NO
title: Mulliken charges:
elementType: Cl N C C C C C C C C C C C C H H H H H H H H H H H H H H H H H H
charge: -0.067366 -0.107554 0.008233 -0.205866 0.485599 -0.790282 -0.777137 -0.629950 -0.635542 -0.410168 -0.387861 -0.228451 -0.230261 -0.107860 0.202414 0.217705 0.248602 0.226885 0.229452 0.216176 0.211264 0.255720 0.189692 0.218162 0.230826 0.248407 0.217062 0.188749 0.237708 0.242209 0.252077 0.251355
chargesum: 0.00000
title: Mulliken charges with hydrogens summed into heavy atoms:
elementType: Cl N C C C C C C C C C C C C
charge: -0.067366 -0.107554 0.210646 0.011840 0.485599 -0.085343 -0.093977 0.008731 0.018677 -0.172460 -0.145652 0.023626 0.021094 -0.107860
polarizability: 2.06984998e+02 2.03857461e+00 1.31016983e+02 -9.85750163e+00 5.34087299e+00 1.00841538e+02
1716.lowfreq: -7.9073 -0.0018 -0.0013 -0.0011 3.0436 14.0959 24.8988 43.8687 55.3974
frequency: 24.5354 43.7571 55.2960 65.2144 147.1155 170.1473 184.2328 224.7538 233.7924 241.3693 262.3202 285.4185 301.1140 309.5550 315.0222 372.9165 391.7849 409.3382 440.4094 448.9836 478.8686 518.8508 594.3768 626.0117 646.1698 711.3808 758.6498 767.0595 827.3597 830.9723 839.4182 942.6486 947.4410 964.6965 991.6479 995.7278 1001.4369 1031.1758 1043.2962 1072.8200 1079.6034 1085.0584 1101.6950 1119.5819 1135.2506 1142.8567 1185.8202 1206.8306 1225.3335 1247.7799 1265.4799 1286.6952 1307.1913 1335.9671 1349.4561 1379.6295 1383.7134 1389.3511 1397.1839 1418.5205 1445.9184 1466.6042 1467.6544 1468.5993 1476.5382 1478.6480 1482.6344 1489.3870 1496.7302 1505.0028 1583.0155 1598.2317 2810.8225 2844.2176 2860.4630 2985.3724 2988.5051 2993.9783 3033.1242 3035.3664 3074.3998 3085.3625 3089.4340 3091.3111 3091.8385 3100.7468 3121.6277 3147.4337 3165.2320 3170.0625
redmass: 2.7313 4.0375 4.4588 3.1885 4.9406 2.3067 2.6381 1.3843 1.6731 1.3192 1.6098 2.4780 1.4356 2.8566 4.3785 2.3167 2.9714 2.9046 3.4026 2.8738 2.7528 2.6923 2.4165 6.7629 4.3982 3.6649 2.7152 3.3030 1.3331 1.9651 1.8384 2.0084 1.3701 1.3662 2.0910 1.6469 2.6893 1.5297 1.6484 2.5989 1.7189 1.2894 1.5697 1.9736 1.7980 1.8944 1.1179 2.7738 2.5320 2.1261 1.4986 1.3630 1.3095 1.5712 1.4534 4.0423 1.3688 1.2686 2.0155 1.1408 1.1612 1.0611 1.0863 1.0491 2.1768 1.0556 1.0463 1.0573 1.0508 1.0521 7.2798 6.2001 1.0805 1.0579 1.0582 1.0362 1.0791 1.0386 1.0722 1.0728 1.0992 1.0996 1.0996 1.0992 1.0990 1.0976 1.0895 1.0877 1.0952 1.0967
irintensity: 0.6392 0.0800 0.2449 0.2719 0.1434 0.8710 0.2912 0.3131 1.4063 0.1729 1.3423 0.9788 0.0668 5.9760 0.2567 2.6661 7.2468 0.0149 2.5396 2.3376 14.3032 19.9707 1.7351 0.7706 14.1857 2.9559 6.7429 16.9557 8.0794 18.0028 30.0722 22.4253 0.5775 0.1269 36.9011 27.6474 7.0507 15.8143 12.4121 52.5226 3.6094 4.7966 20.1053 23.9848 8.1995 4.8454 0.3395 6.0450 7.8174 6.7273 20.5261 7.9432 3.6578 6.0266 6.3338 0.8559 15.8700 21.7605 25.2485 2.3540 6.7973 7.6012 19.4639 5.0023 90.0088 5.8753 41.0044 5.6407 7.9499 8.3293 2.3461 3.6905 72.0914 71.8966 193.8261 22.6648 26.1448 11.6824 20.8745 68.2640 38.9529 29.0596 43.4479 19.5229 36.4410 22.3841 14.6560 5.4354 8.4390 2.2862
temp: 298.150 k
press: 1.00000 atm
elementType: 17 7 6 6 6 6 6 6 6 6 6 6 6 6 1 1 1 1 1 1 1 1 1 1 1 1 1 1 1 1 1 1
symmnumber: 1
zpe: 713024.2 jmol-1
zpe.correction: 0.271577 hartree
zpe.thermalcorrener: 0.286867 hartree
zpe.thermalcorrenthalpy: 0.287811 hartree
zpe.thermalcorrgfe: 0.228296 hartree
zpe.sumelectzpe: -981.782505 hartree
zpe.sumelectthermal: -981.767215 hartree
zpe.sumelectthermalent: -981.766271 hartree
zpe.sumelectthermalfe: -981.825785 hartree
dipole: 2.8841 -0.5002 -0.1062
dipole: 2.9290
quadrupole: -101.1627 -87.7553 -93.9358
quadrupole: -5.0575 0.7632 2.4770
quadrupole: -6.8781 6.5293 0.3488 -5.0575 0.7632 2.4770
hfenergy: -982.0540816 hartree
pointgroup: C01 [X(C12H18Cl1N1)]
dipole: 1.1370553 0.1868949 0.0119402 debye
polarizability: 206.1787059|0.8382088|130.8920684|13.6092798|-5.7027659|101.7727448 unknown
InChI: InChI=1S/C12H18ClN/c1-9(10(2)14(3)4)11-5-7-12(13)8-6-11/h5-10H,1-4H3
charge 0 multiplicity 1
32 atoms
Cl -5.064051 0.378584 -0.714114
N  3.242096 0.21534 -0.062603
C  1.805736 0.049113 -0.445778
C  0.907957 -0.136577 0.842092
C  -0.577269 -0.047025 0.476719
C  1.608793 -1.122106 -1.432609
C  1.303545 -1.398958 1.635126
C  3.49004 1.435676 0.738216
C  4.182057 0.152211 -1.205093
C  -1.128764 1.214682 0.123391
C  -1.440354 -1.172209 0.4612
C  -2.485359 1.358215 -0.239672
C  -2.80312 -1.053621 0.101636
C  -3.304413 0.212742 -0.248145
H  1.443223 0.98497 -0.952227
H  1.109833 0.73713 1.492943
H  0.532478 -1.334511 -1.549344
H  2.007503 -0.887191 -2.43401
H  2.107397 -2.037051 -1.065993
H  0.742513 -1.463259 2.585201
H  1.11525 -2.327434 1.066502
H  2.384001 -1.36583 1.856035
H  3.16275 2.374261 0.220735
H  4.571486 1.520799 0.943875
H  2.975623 1.385806 1.712433
H  4.125829 -0.828471 -1.702559
H  5.212589 0.275017 -0.826767
H  4.00301 0.945336 -1.975671
H  -0.4911 2.10724 0.144106
H  -1.058884 -2.159449 0.740399
H  -2.896766 2.33674 -0.504399
H  -3.458432 -1.929669 0.096277
