program: Gaussian 09
title: 000210908
version: EM64L-G09RevD.01
frameworkgroup: C1[X(C10H13ClO3)]
method: RPBEPBE
basis: SDD
operation: Freq
keyword: #p
keyword: freq=noraman
keyword: PBEPBE/SDD
title: #p freq=noraman PBEPBE/SDD
converged: YES YES NO NO
title: Mulliken charges:
elementType: Cl O O O C C C C C C C C C C H H H H H H H H H H H H H
charge: -0.069167 -0.273307 -0.214999 -0.225771 -0.349478 -0.348594 -0.290536 -0.687563 0.183188 0.172506 0.470471 -0.310513 -0.351861 -0.753714 0.204282 0.230041 0.204432 0.192474 0.229931 0.221920 0.216983 0.210837 0.218794 0.282997 0.267436 0.277408 0.291801
chargesum: 0.00000
title: Mulliken charges with hydrogens summed into heavy atoms:
elementType: Cl O O O C C C C C C C C C C
charge: -0.069167 -0.273307 -0.214999 -0.225771 0.084845 0.048312 0.161315 -0.040949 0.183188 0.172506 0.470471 -0.027516 -0.084425 -0.184504
polarizability: 2.00088938e+02 1.13318946e+01 1.11034139e+02 -7.26904776e+00 1.04719947e+01 1.00174083e+02
1716.lowfreq: -6.3793 -0.8716 -0.0012 0.0013 0.0029 11.6281 22.8396 33.4038 47.3647
frequency: 22.7961 33.3689 47.3624 60.3508 68.5063 104.6376 111.1235 131.4693 161.3178 200.2124 233.3355 254.7058 287.6700 320.9443 348.6542 401.8118 450.5431 502.7288 562.3973 591.4342 668.5109 705.1125 717.1727 728.8435 745.7580 807.9901 827.0467 868.4392 881.3042 901.3490 903.5215 935.4905 942.6569 945.5553 1021.5340 1032.2445 1074.3685 1076.1899 1106.5897 1116.1052 1165.1596 1210.9662 1226.7336 1229.9655 1242.7781 1272.7529 1279.7980 1289.9771 1290.1749 1345.7523 1357.5258 1369.4183 1392.1270 1438.6600 1452.8942 1471.3763 1477.2042 1477.9386 1488.8543 1506.0094 1568.2825 1645.3844 2968.9824 2976.4545 2993.1941 3014.8126 3021.2641 3053.5994 3074.5578 3076.6999 3084.5675 3101.2236 3169.3660 3227.9075 3253.1935
redmass: 5.6229 4.1603 5.3529 4.5701 2.0341 3.4105 4.5796 3.2152 6.4863 3.7754 1.1454 3.9975 3.1427 6.8468 4.0116 3.0073 5.6182 5.6575 7.7470 5.4638 4.9770 5.1361 6.5959 3.6137 1.1094 1.2757 1.3273 2.3350 3.9313 1.8194 1.4036 2.4119 2.7784 2.2842 1.4991 2.8524 3.5125 2.4596 1.3851 2.5107 1.7504 1.5114 1.6273 2.2491 1.2880 1.3219 4.2327 1.0953 1.1288 1.4445 3.3167 1.3789 1.2126 1.1451 1.1112 1.0679 1.0569 1.0496 1.0886 7.1253 6.6806 10.6281 1.0587 1.0365 1.0599 1.0998 1.0577 1.1031 1.1012 1.0995 1.0575 1.1084 1.1113 1.0958 1.1032
irintensity: 0.6291 2.5466 1.7590 0.2510 0.6485 0.6951 2.0649 2.3633 1.1920 0.6602 0.6279 3.2810 11.1141 12.5234 9.4991 3.2771 2.5410 1.5501 60.8459 2.5740 47.6610 17.2051 21.8134 5.9645 7.6345 1.5516 50.5615 6.8301 1.6755 5.7714 0.8808 34.2566 5.6240 21.8346 46.9334 10.7609 355.3938 6.5326 23.2053 2.8360 25.3208 110.9873 60.9472 78.2612 101.2368 1.4443 43.4863 3.7637 2.0639 3.6090 2.9530 1.9381 9.5468 6.0677 14.2916 0.6044 8.1620 8.9488 18.4073 55.3413 8.8459 220.6302 33.6247 31.0968 20.2225 8.7480 51.2101 6.2343 62.1793 52.0677 9.6953 32.7218 0.8061 1.4603 0.5530
temp: 298.150 k
press: 1.00000 atm
elementType: 17 8 8 8 6 6 6 6 6 6 6 6 6 6 1 1 1 1 1 1 1 1 1 1 1 1 1
symmnumber: 1
zpe: 556961.6 jmol-1
zpe.correction: 0.212135 hartree
zpe.thermalcorrener: 0.227231 hartree
zpe.thermalcorrenthalpy: 0.228176 hartree
zpe.thermalcorrgfe: 0.166606 hartree
zpe.sumelectzpe: -1073.509496 hartree
zpe.sumelectthermal: -1073.494400 hartree
zpe.sumelectthermalent: -1073.493456 hartree
zpe.sumelectthermalfe: -1073.555025 hartree
dipole: -1.1526 -3.5705 -1.6663
dipole: 4.1053
quadrupole: -76.0540 -90.7929 -91.8407
quadrupole: -9.6307 2.6366 0.9777
quadrupole: 10.1752 -4.5637 -5.6115 -9.6307 2.6366 0.9777
hfenergy: -1073.7216312 hartree
pointgroup: C01 [X(C10H13Cl1O3)]
dipole: 0.3453157 -0.5602287 -1.474977 debye
polarizability: 195.4145215|15.2359173|100.7287646|-20.0567239|7.6971611|115.1538749 unknown
InChI: InChI=1S/C10H13ClO3/c1-2-3-6-13-10(12)9-5-4-8(7-11)14-9/h4-5H,2-3,6-7H2,1H3
charge 0 multiplicity 1
27 atoms
Cl -4.510045 -0.915116 2.285853
O  1.409976 -0.086593 -1.123557
O  -1.902511 0.439517 0.293231
O  0.75465 1.508867 0.474189
C  3.590326 -0.301624 0.075645
C  5.068698 0.152696 0.122564
C  2.815814 0.414703 -1.038613
C  5.868603 -0.574488 1.224986
C  -0.835221 -0.077693 -0.461097
C  0.482604 0.550846 -0.286498
C  -3.042028 -0.308728 -0.055201
C  -1.289394 -1.124579 -1.262602
C  -2.693733 -1.271753 -1.003646
C  -4.300256 0.038648 0.62515
H  3.540339 -1.395481 -0.089345
H  3.106965 -0.090698 1.048178
H  5.112462 1.246911 0.295659
H  5.545779 -0.030271 -0.862077
H  2.792279 1.506373 -0.867719
H  3.232491 0.193307 -2.035323
H  5.430584 -0.383755 2.222342
H  5.866775 -1.668366 1.06053
H  6.920696 -0.236844 1.24691
H  -0.672658 -1.70093 -1.947306
H  -3.370059 -1.99855 -1.449111
H  -5.180195 -0.253403 0.038017
H  -4.341239 1.095706 0.919741
