program: Gaussian 09
title: 000216286
version: EM64L-G09RevD.01
frameworkgroup: C1[X(C20H29NO)]
method: RPBEPBE
basis: SDD
operation: Freq
keyword: #p
keyword: freq=noraman
keyword: PBEPBE/SDD
title: #p freq=noraman PBEPBE/SDD
converged: YES YES NO NO
title: Mulliken charges:
elementType: O N C C C C C C C C C C C C C C C C C C C C H H H H H H H H H H H H H H H H H H H H H H H H H H H H H
charge: -0.441147 -0.085736 0.339911 0.181172 -0.185272 -0.496867 -0.621937 0.313156 -0.394582 -0.806859 -0.796697 0.295020 -0.816426 -0.419620 -0.538020 -0.381366 0.263428 -0.427732 -0.333433 0.384786 -0.787911 -0.794224 0.211026 0.218963 0.202847 0.236416 0.228827 0.204311 0.226573 0.221760 0.246303 0.206647 0.254088 0.205449 0.204429 0.224949 0.211483 0.233560 0.208839 0.180987 0.255621 0.232561 0.218126 0.235402 0.351611 0.215091 0.231292 0.216192 0.222213 0.216831 0.227960
chargesum: 0.00000
title: Mulliken charges with hydrogens summed into heavy atoms:
elementType: O N C C C C C C C C C C C C C C C C C C C C
charge: -0.089535 -0.085736 0.339911 0.181172 0.025754 -0.075057 -0.156695 0.313156 0.036302 -0.132148 -0.132731 0.295020 -0.146434 -0.029794 -0.282399 -0.148806 0.263428 -0.209607 -0.098032 0.384786 -0.125336 -0.127220
polarizability: 2.57618804e+02 1.04295136e+01 2.24788044e+02 6.66921949e+00 -7.48840036e+00 1.88778445e+02
1716.lowfreq: -22.5840 -4.7945 -0.0006 -0.0005 -0.0004 15.4345 22.1802 30.4429 55.5419
frequency: 20.7600 30.0299 55.3002 59.9672 96.2580 116.7383 127.1738 155.9815 162.6713 184.8930 202.4308 203.1836 225.4518 235.3402 248.6803 253.9732 278.0363 291.5996 302.4361 315.7331 320.4436 334.7339 340.6490 352.1440 371.8990 382.2819 390.9965 409.0279 430.6015 444.9771 463.5156 470.1402 474.9232 493.9185 509.4352 527.3817 557.9174 597.3181 630.3157 662.6283 690.9294 703.2548 728.4637 767.5441 772.2426 786.3224 793.4697 839.5213 857.4659 879.4581 885.1691 902.2079 910.6609 926.8116 928.3188 941.9940 946.9325 960.2821 976.6141 997.0994 1002.6632 1014.5088 1024.3103 1029.4536 1042.8687 1061.6401 1082.5995 1086.5988 1101.8529 1122.5808 1131.1827 1137.9462 1147.3177 1150.9828 1166.1695 1179.0037 1189.6410 1195.4478 1203.5895 1213.5875 1228.3537 1242.1632 1247.3810 1254.0784 1265.4406 1281.3509 1295.3820 1317.2998 1332.2050 1341.7268 1355.6813 1362.9278 1368.1711 1378.4078 1382.0808 1386.5623 1389.2399 1397.6065 1399.5476 1432.7778 1452.4773 1455.3995 1457.6671 1459.7763 1463.1321 1467.3128 1471.9827 1472.6728 1475.0044 1479.2836 1485.2800 1489.2727 1495.1763 1497.8991 1509.7864 1584.2647 1625.4273 1694.5436 2860.2746 2867.8330 2957.3068 2959.5259 2963.1297 2970.5279 2974.0291 2977.5945 2983.5656 2987.4476 2991.2943 3005.4120 3019.5721 3028.2887 3032.2638 3045.7292 3060.4350 3065.8793 3076.0075 3079.7010 3084.7319 3088.2193 3091.5100 3092.6501 3106.3426 3108.9402 3130.2566 3170.2252 3583.8738
redmass: 3.3013 3.4414 3.1246 4.3463 3.6697 1.2789 1.8961 2.2683 1.3415 1.3548 2.5930 3.2768 2.5343 1.8614 1.6364 1.7114 2.6091 1.7437 2.0195 2.4391 2.9224 1.1358 2.7477 2.6693 2.2198 2.6447 2.4234 3.6486 3.0298 2.5650 3.1637 2.9901 3.9732 2.9116 3.1699 3.0959 2.7204 3.3847 3.2962 4.7296 3.9625 3.8096 3.4340 2.8264 2.7590 2.1843 1.4685 2.2157 1.6428 1.7239 2.0639 1.9702 2.1027 2.0836 1.4341 1.5800 1.3818 1.7676 2.0346 1.2540 1.4303 1.5933 2.0486 2.1067 1.9971 2.4014 1.6811 2.6147 2.0637 2.2781 2.3352 2.4801 1.3757 1.9529 1.8499 1.9084 1.8959 2.0994 1.9864 1.6092 1.8497 1.7063 1.9254 1.7454 2.3917 1.5760 1.6496 1.4358 1.4640 1.5999 1.3871 1.3858 1.2146 5.7522 1.4585 1.2105 1.2685 1.2054 1.2149 2.6126 1.0925 1.0578 1.0737 1.0989 1.0801 1.0566 1.0751 1.0459 1.0837 1.1071 1.0815 2.2218 1.0576 1.0612 1.1002 6.9422 6.4279 6.5442 1.0713 1.0674 1.0375 1.0690 1.0384 1.0846 1.0432 1.0698 1.0418 1.0524 1.0441 1.0985 1.0863 1.0968 1.0962 1.1023 1.0967 1.0952 1.0974 1.0980 1.0987 1.0950 1.0908 1.0991 1.0865 1.0983 1.0969 1.0898 1.0660
irintensity: 0.0542 0.0511 0.0621 0.0819 0.9538 0.6791 1.4279 0.0200 1.4785 0.8425 0.4297 1.8681 2.9148 0.8826 1.0317 0.1168 1.4653 1.8142 2.1350 1.0135 1.3883 132.9560 3.3375 1.0059 1.9548 3.8552 0.8472 2.6599 5.6143 4.2429 2.6777 8.7563 0.9500 2.1958 3.5669 2.9114 2.7578 3.5611 1.5775 2.8984 7.2818 3.8488 2.0282 8.4599 0.9116 11.7494 36.2150 13.4913 13.9904 6.3141 10.5078 15.2661 25.2952 25.5783 2.5853 0.9175 0.5287 2.0824 14.3994 5.9244 5.3193 0.9782 7.8687 27.0286 8.8695 1.7522 1.3442 89.5922 5.2378 2.7869 35.1053 11.3752 97.3945 36.4396 45.2719 14.8475 5.3901 8.9550 9.9528 12.0273 2.5910 3.0468 4.1686 2.9537 45.4326 16.4640 20.8743 18.0187 9.3825 8.6132 11.7611 1.7710 12.3603 14.0342 10.2336 21.2920 23.4346 41.3509 1.7078 4.8483 4.9466 3.1082 0.3557 6.7566 17.2687 11.1163 7.0427 28.9335 9.9463 1.1981 3.9888 72.7266 5.9529 13.2544 21.0767 32.8204 48.7905 12.4928 33.4422 106.8750 37.5771 7.1603 65.3995 11.0571 12.0796 82.1993 75.3099 5.3065 48.0070 31.1200 33.8542 8.5133 45.8711 35.4760 3.8884 67.0906 19.7388 19.1297 37.7803 25.5011 37.2667 37.7668 16.0384 21.8010 26.5587 4.5950 34.6578
temp: 298.150 k
press: 1.00000 atm
elementType: 8 7 6 6 6 6 6 6 6 6 6 6 6 6 6 6 6 6 6 6 6 6 1 1 1 1 1 1 1 1 1 1 1 1 1 1 1 1 1 1 1 1 1 1 1 1 1 1 1 1 1
symmnumber: 1
zpe: 1161980.1 jmol-1
zpe.correction: 0.442575 hartree
zpe.thermalcorrener: 0.465054 hartree
zpe.thermalcorrenthalpy: 0.465998 hartree
zpe.thermalcorrgfe: 0.392260 hartree
zpe.sumelectzpe: -907.795127 hartree
zpe.sumelectthermal: -907.772648 hartree
zpe.sumelectthermalent: -907.771704 hartree
zpe.sumelectthermalfe: -907.845443 hartree
dipole: 0.7737 -1.6370 1.3241
dipole: 2.2432
quadrupole: -131.9497 -125.4101 -133.3984
quadrupole: 3.5789 -4.0722 -3.5822
quadrupole: -1.6970 4.8426 -3.1457 3.5789 -4.0722 -3.5822
hfenergy: -908.2377022 hartree
pointgroup: C01 [X(C20H29N1O1)]
dipole: 0.2726572 -0.6241647 0.5611822 debye
polarizability: 258.3810086|9.3992871|222.8910881|6.2323886|-9.7593421|189.913196 unknown
InChI: InChI=1S/C20H29NO/c1-14(2)8-10-21-11-9-20(5)17-13-16(22)7-6-15(17)12-18(21)19(20,3)4/h6-8,13,18,22H,9-12H2,1-5H3
charge 0 multiplicity 1
51 atoms
O  -4.780902 -2.156117 -1.153563
N  1.522865 0.60716 0.173575
C  -0.484044 2.103427 0.314724
C  -1.17556 1.249966 -0.832353
C  0.466263 1.129214 1.088343
C  -0.054148 0.649174 -1.75214
C  -0.356733 0.033143 1.825001
C  -1.943644 0.05464 -0.211176
C  0.995205 -0.167568 -0.9754
C  -1.53947 2.697843 1.287337
C  0.368575 3.2838 -0.222988
C  -1.506705 -0.5461 1.009001
C  -2.105625 2.127148 -1.709772
C  2.642328 -0.073747 0.870189
C  -3.041164 -0.522872 -0.895109
C  -2.183459 -1.688807 1.498436
C  -3.699927 -1.663299 -0.392285
C  -3.27572 -2.261622 0.816063
C  3.898538 -0.100999 0.021306
C  4.74353 -1.148642 -0.201804
C  5.992911 -0.968796 -1.050665
C  4.558273 -2.549218 0.358121
H  0.999202 1.724493 1.858416
H  0.445468 1.476004 -2.291213
H  -0.526789 -0.000955 -2.513797
H  -0.765355 0.470516 2.759085
H  0.320387 -0.78114 2.152499
H  0.553152 -1.142418 -0.650304
H  1.845739 -0.411182 -1.639329
H  -2.091313 3.522932 0.802036
H  -2.279598 1.950704 1.621443
H  -1.040967 3.117679 2.182438
H  1.217975 2.931132 -0.828272
H  -0.233306 3.998513 -0.811732
H  0.789832 3.842928 0.635165
H  -1.568554 3.019328 -2.074085
H  -2.446674 1.577121 -2.605194
H  -3.000567 2.460763 -1.155746
H  2.847454 0.50756 1.794037
H  2.373026 -1.106836 1.201791
H  -3.413452 -0.103034 -1.83303
H  -1.844697 -2.142594 2.438435
H  -3.781522 -3.150488 1.215154
H  4.133769 0.870053 -0.439761
H  -5.180746 -2.949369 -0.718653
H  6.906648 -1.201192 -0.467239
H  6.084597 0.062864 -1.432189
H  5.988282 -1.659549 -1.917504
H  5.350959 -2.783918 1.096857
H  4.646039 -3.303547 -0.448509
H  3.584826 -2.690993 0.855462
