program: Gaussian 09
title: 000015134
version: EM64L-G09RevD.01
frameworkgroup: C1[X(C12H20Cl4N2O2)]
method: RPBEPBE
basis: SDD
operation: Freq
keyword: #p
keyword: freq=noraman
keyword: PBEPBE/SDD
title: #p freq=noraman PBEPBE/SDD
converged: YES YES NO NO
title: Mulliken charges:
elementType: Cl Cl Cl Cl O O N N C C C C C C C C C C C C H H H H H H H H H H H H H H H H H H H H
charge: 0.044744 0.053415 0.045113 0.053096 -0.214680 -0.214679 -0.360481 -0.360538 -0.372838 -0.372776 -0.377579 -0.377695 -0.367466 -0.367353 -0.402398 -0.402420 0.391834 0.391790 -0.712056 -0.712019 0.189346 0.201786 0.201761 0.189348 0.186721 0.200304 0.186758 0.200286 0.238431 0.205134 0.205141 0.238336 0.215384 0.262190 0.215434 0.262222 0.305725 0.305714 0.312486 0.312481
chargesum: 0.00000
title: Mulliken charges with hydrogens summed into heavy atoms:
elementType: Cl Cl Cl Cl O O N N C C C C C C C C C C C C
charge: 0.044744 0.053415 0.045113 0.053096 -0.214680 -0.214679 -0.054757 -0.054824 0.018293 0.018333 0.009446 0.009349 0.076098 0.076124 0.075176 0.075236 0.391834 0.391790 -0.399570 -0.399539
polarizability: 2.27919595e+02 6.10109639e-03 1.90785464e+02 -1.00577501e+00 3.63418298e-02 1.45448595e+02
1716.lowfreq: -11.3066 -5.0935 -0.0019 0.0008 0.0022 2.0252 5.8572 10.1420 10.5438
frequency: 5.3344 9.6246 10.5049 12.2662 17.8786 22.8016 23.9300 48.8802 49.0462 66.8360 97.0230 110.5338 132.4466 137.9492 140.4882 176.1855 191.4522 206.2562 207.6496 216.1386 219.6566 234.9107 261.3904 307.7200 314.2547 351.0525 352.4406 417.1082 423.0722 497.3084 497.4997 540.9152 542.7955 621.0532 621.3706 666.0695 667.3926 709.7296 709.7903 720.9882 736.1589 756.2796 757.6574 768.6943 814.3773 846.0019 873.8766 900.6649 905.1668 937.9092 965.5366 1002.9542 1018.3900 1036.0796 1061.4417 1075.0158 1083.2883 1088.7594 1105.8480 1129.4122 1146.7586 1163.8162 1165.8725 1186.1854 1186.4411 1210.6816 1219.9731 1246.0585 1263.5841 1268.9378 1276.8643 1280.4170 1284.9907 1294.7074 1296.6491 1301.6130 1326.6183 1347.4988 1351.2491 1353.5667 1365.6516 1367.3799 1448.3410 1448.5757 1456.4610 1457.5976 1461.6838 1463.8263 1474.9926 1479.6045 1480.8948 1484.5397 1640.8694 1640.9626 2946.5383 2948.1208 2953.6162 2962.2100 2979.8499 2980.0443 2986.3032 2992.6045 3003.8174 3004.4951 3010.2922 3032.3966 3049.2161 3051.5838 3079.2935 3079.3666 3103.5150 3103.5358 3553.7929 3553.8142
redmass: 9.4588 17.7090 14.8324 11.5556 12.7949 9.8880 5.6309 1.7727 4.6295 4.1821 3.9284 2.6707 2.7846 2.4745 3.2491 6.2755 5.7507 5.1807 6.3104 8.8870 5.8853 4.8421 6.2608 5.2086 5.2529 2.9783 5.0496 2.9827 3.5600 1.5374 1.5642 1.6697 1.8029 9.3189 9.5689 4.7779 4.9036 4.0075 3.8864 1.1438 1.3159 5.4385 7.9418 1.5971 1.8130 2.0565 1.8776 3.0516 3.2428 2.2911 2.2310 1.5891 3.0329 3.4947 2.8280 2.6625 2.1880 2.3090 3.0817 1.9422 1.5784 1.6313 1.6796 1.0664 1.0660 1.2899 1.4060 1.2861 1.2837 1.3586 1.6704 1.3976 1.0986 1.1839 1.1060 1.2117 1.2874 1.4107 1.4069 1.5822 1.3492 1.3923 1.1190 1.1169 1.0842 1.0748 1.0634 1.0928 1.1197 1.6184 1.6291 1.1251 7.7949 7.8241 1.0586 1.0592 1.0592 1.0599 1.0666 1.0637 1.0901 1.0960 1.0671 1.0637 1.0977 1.1031 1.1004 1.1011 1.1030 1.1029 1.0892 1.0892 1.0782 1.0782
irintensity: 0.3683 2.1285 1.8040 0.8163 8.1625 0.0109 2.2399 0.0654 0.0525 1.5589 0.9747 0.2557 1.7896 1.5360 1.3447 3.6256 0.9115 2.5305 0.3014 1.5262 1.6424 0.0124 4.2880 6.5091 1.6192 1.3679 8.8819 4.8758 10.9935 118.7217 20.4846 16.9791 123.2141 155.8601 35.5383 8.9786 11.6655 16.6852 50.6205 5.2171 7.5506 16.1950 70.2341 1.2581 6.7971 5.3310 2.4858 2.6461 0.7149 2.4714 2.8606 0.0117 0.1739 6.6259 10.0355 1.4132 0.9019 9.7240 1.0909 13.4642 0.1470 48.0351 86.1874 11.6887 8.6784 0.0027 4.7422 20.4647 0.2474 7.9028 13.1161 11.7885 7.0498 3.2030 0.3335 40.9265 5.6980 1.0990 0.3392 0.5098 0.5133 6.1329 75.9523 1.8078 0.4785 5.5860 3.6682 4.5183 11.5132 68.0807 209.0442 27.7233 292.4676 25.9921 17.6899 1.4299 0.1717 88.9673 53.3988 5.7375 19.1301 13.8907 10.0969 45.0099 4.1267 27.0016 0.2911 179.4211 12.0932 9.6871 10.0654 12.0795 12.9641 26.3254
temp: 298.150 k
press: 1.00000 atm
elementType: 17 17 17 17 8 8 7 7 6 6 6 6 6 6 6 6 6 6 6 6 1 1 1 1 1 1 1 1 1 1 1 1 1 1 1 1 1 1 1 1
symmnumber: 1
zpe: 823279.2 jmol-1
zpe.correction: 0.313570 hartree
zpe.thermalcorrener: 0.338234 hartree
zpe.thermalcorrenthalpy: 0.339178 hartree
zpe.thermalcorrgfe: 0.247057 hartree
zpe.sumelectzpe: -2567.882558 hartree
zpe.sumelectthermal: -2567.857895 hartree
zpe.sumelectthermalent: -2567.856951 hartree
zpe.sumelectthermalfe: -2567.949072 hartree
dipole: -0.0174 6.9100 -0.0045
dipole: 6.9100
quadrupole: -203.2441 -144.8323 -150.6022
quadrupole: -0.0168 41.2356 -0.0088
quadrupole: -37.0179 21.3939 15.6240 -0.0168 41.2356 -0.0088
hfenergy: -2568.1961285 hartree
pointgroup: C01 [X(C12H20Cl4N2O2)]
dipole: 0.0012547 2.7185332 0.0199187 debye
polarizability: 227.931403|-0.105913|190.7822731|0.1143112|0.3992519|145.4399779 unknown
InChI: InChI=1S/C12H20Cl4N2O2/c13-9(14)11(19)17-7-5-3-1-2-4-6-8-18-12(20)10(15)16/h9-10,17-18H,1-8H2
charge 0 multiplicity 1
40 atoms
Cl -4.806016 -3.072717 -0.183165
Cl -7.6209 -1.962141 -0.677624
Cl 4.806892 -3.10817 0.119686
Cl 7.620162 -2.008679 0.646839
O  -5.784208 -0.417405 1.483157
O  5.790929 -0.428794 -1.498426
N  -4.900589 0.661529 -0.38681
N  4.910839 0.625106 0.387451
C  -0.559404 1.737927 0.532707
C  0.576629 1.7436 -0.514136
C  -1.970625 1.74999 -0.097791
C  1.987956 1.735566 0.116181
C  -3.096491 1.813336 0.957142
C  3.113997 1.80941 -0.937904
C  -4.520746 1.880036 0.358121
C  4.538717 1.857529 -0.338242
C  -5.501802 -0.405989 0.255574
C  5.507345 -0.435201 -0.271079
C  -5.802185 -1.581326 -0.69534
C  5.801298 -1.626669 0.661594
H  -0.44998 2.621876 1.195568
H  -0.458937 0.84556 1.184568
H  0.470513 0.863599 -1.181731
H  0.472775 2.639841 -1.161196
H  -2.05573 2.621256 -0.78213
H  -2.09296 0.840964 -0.722643
H  2.078908 2.594423 0.815289
H  2.104502 0.815183 0.725317
H  -3.038596 0.939058 1.633506
H  -2.956959 2.713226 1.590027
H  2.979829 2.720438 -1.555818
H  3.050593 0.946693 -1.628476
H  -4.610521 2.742994 -0.328401
H  -5.258568 2.000674 1.170256
H  4.634138 2.709061 0.361668
H  5.277259 1.986017 -1.1485
H  -4.668143 0.598748 -1.379172
H  4.677097 0.547915 1.378491
H  -5.541421 -1.393958 -1.745904
H  5.535601 -1.456506 1.713843
