program: Gaussian 09
title: 000210896
version: EM64L-G09RevD.01
frameworkgroup: C1[X(C13H22N6O)]
method: RPBEPBE
basis: SDD
operation: Freq
keyword: #p
keyword: freq=noraman
keyword: PBEPBE/SDD
title: #p freq=noraman PBEPBE/SDD
converged: YES YES NO NO
title: Mulliken charges:
elementType: O N N N N N N C C C C C C C C C C C C C H H H H H H H H H H H H H H H H H H H H H H
charge: -0.249582 -0.117922 -0.101755 -0.112433 -0.135774 -0.122730 -0.587141 -0.402616 -0.376992 -0.376655 -0.395673 -0.398996 -0.337813 -0.342884 -0.436791 0.130762 -0.324237 -0.315611 0.097187 0.011540 0.220323 0.190164 0.200208 0.209448 0.209715 0.201157 0.203507 0.268412 0.275529 0.202684 0.182093 0.251327 0.211232 0.187196 0.197872 0.220276 0.192825 0.209784 0.209585 0.192326 0.332489 0.327963
chargesum: 0.00000
title: Mulliken charges with hydrogens summed into heavy atoms:
elementType: O N N N N N N C C C C C C C C C C C C C
charge: -0.249582 -0.117922 -0.101755 -0.112433 -0.135774 -0.122730 0.073311 0.007871 0.032665 0.034217 0.076246 0.079217 0.095607 0.055545 -0.018644 0.130762 0.078372 0.086301 0.097187 0.011540
polarizability: 2.37920151e+02 1.52053506e+01 2.04095744e+02 1.41454297e+01 -3.05028268e+00 1.32538251e+02
1716.lowfreq: -11.9228 -4.8355 -0.0006 -0.0001 0.0005 9.1024 20.7183 27.4533 42.3854
frequency: 20.1520 26.8830 42.2675 48.3023 68.5733 117.5941 136.9923 154.7508 192.8691 206.5317 225.8269 239.5470 247.8772 263.3516 291.9656 318.2810 350.0178 380.9590 392.5393 395.0903 428.2778 443.8382 465.6971 477.9315 492.2641 534.7604 546.9224 561.9487 575.4007 595.2900 628.9624 702.6564 713.7438 770.1253 799.0659 805.1991 807.3197 818.9178 840.7369 848.2500 850.5974 892.7172 899.0245 902.8476 941.9928 949.8169 976.9317 996.9784 1007.0576 1028.9426 1032.5385 1044.5363 1054.2385 1084.2383 1086.9121 1099.3390 1102.1667 1122.9576 1126.5399 1141.5528 1155.5595 1166.1369 1190.0129 1211.2497 1233.3691 1249.5669 1254.8438 1268.3894 1274.7691 1277.9617 1292.4079 1294.7926 1324.3801 1327.0063 1336.2917 1337.5787 1343.2620 1345.6704 1351.7034 1360.9426 1366.7960 1369.7776 1394.5644 1431.5115 1441.3243 1444.9869 1449.2595 1455.1464 1455.4659 1462.5518 1464.1710 1464.9696 1468.4043 1470.6686 1476.2712 1524.1659 1548.2046 1613.5252 2851.6326 2860.5444 2894.3210 2953.6685 2954.1035 2957.5882 2958.4659 2966.9464 2985.8931 2986.6528 3027.6909 3035.7263 3046.4133 3053.0593 3054.7847 3070.3273 3075.8938 3079.6412 3099.3730 3100.5027 3555.3370 3716.0441
redmass: 3.7238 3.9504 3.8357 4.0451 3.8279 4.0878 3.7008 7.0099 5.0542 5.2880 3.0539 2.1616 2.3123 2.4302 2.8857 2.3722 3.1228 2.5025 1.9375 1.9620 5.4414 2.9097 2.7875 1.2310 2.3133 3.4892 1.1032 2.8304 4.5698 2.5630 2.8057 5.4933 11.1443 5.2059 4.5003 1.5840 3.2924 6.7032 1.6231 1.7499 2.1617 2.6193 2.9750 6.0360 2.1740 1.3146 3.2733 2.5566 2.5364 2.2213 2.7266 2.2481 1.9263 3.1207 1.5797 2.2934 2.1684 2.5826 2.1965 2.5101 1.2809 2.3589 1.0662 1.5354 2.7970 2.3776 1.3046 1.2846 1.2544 1.4884 1.2398 1.6402 1.3294 1.2650 1.3099 1.2979 1.4584 1.4732 1.7351 1.4397 1.4485 1.4699 2.1417 4.2106 1.0840 1.0948 1.0969 1.0970 1.0811 1.0933 1.1137 1.1027 3.4011 1.2408 1.1111 3.5688 3.7137 1.8776 1.0708 1.0697 1.0691 1.0698 1.0661 1.0699 1.0665 1.0639 1.0613 1.0607 1.0894 1.0961 1.1027 1.0893 1.1032 1.0898 1.0966 1.0980 1.0920 1.0936 1.0441 1.1057
irintensity: 0.0364 0.2793 0.2548 0.2949 0.0629 2.6384 5.1708 0.5523 4.9685 0.8301 1.3763 1.0440 2.1099 3.2857 4.6024 9.5936 7.9172 1.6552 1.4448 1.2582 6.9059 0.6377 1.9699 273.0022 3.1658 5.3626 0.0920 22.7632 3.7189 5.1017 3.5100 2.2453 0.4308 17.4491 12.8683 1.8291 10.7411 28.3039 0.5557 28.0277 0.9635 16.5179 4.6842 38.5968 28.2727 6.7106 10.3979 21.9914 18.3311 17.1914 17.0793 8.0109 14.8980 32.6358 5.3143 3.9418 22.9411 47.9735 1.3075 18.5935 0.4210 1.7738 1.3718 20.9335 16.6262 24.7673 3.1284 5.3548 30.8904 98.2997 4.6170 52.0631 20.1777 1.1995 0.2261 6.9188 10.7375 1.6647 6.7240 3.9959 4.5229 0.3567 3.8627 47.8430 2.4616 8.7040 16.1736 17.0380 4.2031 22.1471 46.9881 16.3629 327.8969 26.5663 16.9846 491.4731 858.1003 333.2679 47.0135 131.4772 107.2413 11.1316 37.3606 52.0174 137.9293 51.9540 30.6607 34.6736 37.8223 68.9399 31.9313 10.9956 97.5000 13.6878 44.1570 42.9448 5.5243 5.8518 96.0933 43.5917
temp: 298.150 k
press: 1.00000 atm
elementType: 8 7 7 7 7 7 7 6 6 6 6 6 6 6 6 6 6 6 6 6 1 1 1 1 1 1 1 1 1 1 1 1 1 1 1 1 1 1 1 1 1 1
symmnumber: 1
zpe: 936089.1 jmol-1
zpe.correction: 0.356538 hartree
zpe.thermalcorrener: 0.375051 hartree
zpe.thermalcorrenthalpy: 0.375995 hartree
zpe.thermalcorrgfe: 0.308239 hartree
zpe.sumelectzpe: -910.768539 hartree
zpe.sumelectthermal: -910.750026 hartree
zpe.sumelectthermalent: -910.749082 hartree
zpe.sumelectthermalfe: -910.816837 hartree
dipole: -4.2752 0.8680 0.1463
dipole: 4.3649
quadrupole: -126.0476 -100.6728 -119.9284
quadrupole: 3.3629 6.3532 -2.8127
quadrupole: -10.4980 14.8768 -4.3788 3.3629 6.3532 -2.8127
hfenergy: -911.1250768 hartree
pointgroup: C01 [X(C13H22N6O1)]
dipole: 1.7125794 -0.1227245 0.0321202 debye
polarizability: 233.3172228|22.8785509|197.646937|-5.3109845|27.2586461|143.5899869 unknown
InChI: InChI=1S/C13H22N6O/c14-12-15-11(10-18-6-8-20-9-7-18)16-13(17-12)19-4-2-1-3-5-19/h1-10,14H2
charge 0 multiplicity 1
42 atoms
O  -5.54924 0.46716 -0.931571
N  2.552245 0.92711 -0.268914
N  -2.913597 0.127739 0.232099
N  0.39244 0.301851 0.458899
N  1.765537 -1.21435 -0.875701
N  -0.472079 -1.883749 -0.14605
N  0.878988 -3.311268 -1.421096
C  4.952404 2.219802 0.761202
C  5.015107 0.843714 0.054967
C  3.571461 2.428818 1.428321
C  3.84392 0.678774 -0.942687
C  2.426459 2.236563 0.406444
C  -3.572715 -0.980149 -0.506107
C  -3.92643 1.001421 0.874995
C  -1.867129 -0.338453 1.179303
C  1.553132 -0.015024 -0.230844
C  -4.533638 -0.403005 -1.554826
C  -4.881771 1.553896 -0.196177
C  -0.571153 -0.658801 0.456359
C  0.727662 -2.096823 -0.800498
H  5.760855 2.305662 1.511513
H  5.121693 3.022318 0.012887
H  5.972429 0.727905 -0.488686
H  4.961992 0.033741 0.808432
H  3.441257 1.703042 2.254626
H  3.499686 3.443487 1.864875
H  3.956704 1.411856 -1.769838
H  3.811105 -0.332802 -1.373766
H  1.436271 2.274538 0.884144
H  2.478875 3.035678 -0.363625
H  -4.145201 -1.642499 0.193385
H  -2.797642 -1.597171 -0.993159
H  -3.411706 1.843827 1.374509
H  -4.523697 0.450661 1.646295
H  -2.19498 -1.237613 1.754096
H  -1.653635 0.478606 1.888532
H  -3.957355 0.177745 -2.306978
H  -5.103281 -1.202523 -2.057364
H  -5.694403 2.143756 0.260222
H  -4.308467 2.189214 -0.905601
H  0.122103 -3.987599 -1.365448
H  1.744198 -3.516558 -1.913466
