program: Gaussian 09
title: 000216249
version: EM64L-G09RevD.01
frameworkgroup: C1[X(C12H16ClN3O3S)]
method: RPBEPBE
basis: SDD
operation: Freq
keyword: #p
keyword: freq=noraman
keyword: PBEPBE/SDD
title: #p freq=noraman PBEPBE/SDD
converged: YES YES NO NO
title: Mulliken charges:
elementType: Cl S O O O N N N C C C C C C C C C C C C H H H H H H H H H H H H H H H H
charge: -0.038674 0.974991 -0.294006 -0.527908 -0.528444 -0.423998 -0.114808 -0.532269 -0.381240 0.244540 0.192078 -0.477322 0.343219 0.270302 -0.351070 -0.306237 -0.353103 -0.818317 -0.253535 -0.744820 0.223014 0.229132 0.228593 0.234134 0.251508 0.231658 0.310329 0.299053 0.262187 0.270685 0.232918 0.241534 0.258466 0.288251 0.281196 0.277964
chargesum: 0.00000
title: Mulliken charges with hydrogens summed into heavy atoms:
elementType: Cl S O O O N N N C C C C C C C C C C C C
charge: -0.038674 0.974991 -0.294006 -0.527908 -0.528444 -0.113669 -0.114808 -0.233217 0.070905 0.244540 0.192078 -0.014595 0.343219 0.270302 0.132096 -0.306237 -0.090915 -0.073180 0.004931 0.102591
polarizability: 3.02094609e+02 -1.76769498e+01 2.24820689e+02 -5.70207954e+00 1.03670049e+01 1.29629651e+02
1716.lowfreq: -9.9033 -5.2327 -3.0841 -0.0019 -0.0013 -0.0001 21.0726 30.9383 33.4066
frequency: 20.9470 30.8994 33.3156 43.5011 54.7320 68.4447 97.1714 111.7361 136.6405 141.4496 146.5085 151.7106 153.8980 162.3876 184.2165 212.8127 238.3387 250.5096 258.6700 280.4657 309.7686 331.0112 338.0651 359.6792 378.9698 399.8592 420.8952 481.5349 506.4523 514.4779 560.8215 575.0846 585.4802 608.5413 627.1460 678.4460 717.7781 739.7946 759.6547 800.4968 806.5827 829.6410 830.8996 884.9140 897.2354 900.4603 921.1232 923.4510 935.7862 968.5259 979.8749 986.2110 1014.2237 1021.2599 1042.9028 1047.8034 1080.6105 1088.7138 1142.7253 1165.1069 1184.6027 1199.3646 1210.7228 1226.1877 1246.8453 1253.2648 1277.8471 1279.5978 1308.2729 1309.4551 1351.7183 1376.1993 1386.0966 1409.2559 1413.8669 1416.8690 1447.3391 1450.3660 1457.8300 1468.0408 1469.2902 1483.2488 1502.6468 1570.7048 1586.4251 1608.3007 2969.1164 2969.8913 2982.8187 3000.7307 3038.9661 3046.6333 3061.9976 3070.2152 3072.2479 3106.9995 3164.5753 3183.0516 3184.1808 3197.1170 3302.6974 3587.8365
redmass: 6.6419 4.3207 5.1893 6.4851 4.8952 5.9121 4.6150 4.4956 2.4197 2.7652 2.9292 2.4488 2.4727 3.0647 1.4027 4.9189 3.7232 3.9767 5.4714 2.7003 5.8476 6.0744 6.2816 4.4431 8.3986 6.4612 4.8466 1.2393 5.6708 3.7306 3.6195 6.2901 4.2771 5.2469 5.5199 5.0086 3.4745 4.8894 5.4041 1.4878 11.5867 3.9989 1.5171 2.8240 4.3553 4.0646 1.3860 1.4105 3.6715 2.7962 1.2987 2.5030 2.2113 1.8829 2.9977 1.5036 1.6947 2.3197 3.1553 1.1333 1.6835 1.1053 1.1278 2.5958 3.5964 1.3589 1.3653 1.4774 1.4254 1.1440 1.5872 3.7810 1.2588 2.8598 1.0689 1.0808 1.5474 2.1609 1.1997 1.1434 1.3873 1.1594 1.1876 5.6057 7.4738 7.2250 1.0645 1.0622 1.0387 1.0664 1.0249 1.0966 1.1003 1.0938 1.1034 1.0997 1.0882 1.0968 1.1073 1.1071 1.0732 1.0791
irintensity: 1.4773 3.0345 3.0263 2.0969 3.0174 1.7670 0.9588 0.6989 4.5280 3.3218 5.4949 6.9021 3.6366 3.5804 0.4436 12.2243 10.8307 2.8632 7.6768 11.0868 12.1866 16.1389 21.2181 9.4713 21.1774 4.2240 23.3891 147.4924 0.7910 3.1894 1.2323 50.6571 17.7524 3.0307 6.4730 5.0103 3.2159 1.3068 24.3609 42.5301 66.4487 39.0977 2.6323 75.8827 14.2303 2.6504 17.6399 40.6107 30.8487 20.3324 42.1987 12.0905 5.6992 26.5818 7.2885 3.3709 1.0830 189.6807 12.9412 3.7345 101.8919 4.4548 1.8419 0.3524 164.6752 70.5192 4.5384 90.1954 6.3361 2.5766 17.5945 26.8089 14.0131 19.4448 10.7210 17.4524 126.5159 69.1112 18.0105 4.8424 8.9723 50.3037 20.5988 37.1552 0.7244 111.5525 39.4454 48.9298 11.4712 57.3817 0.3253 39.9511 11.9009 11.9470 42.0220 13.7723 3.8357 4.6052 0.1305 0.3979 30.5758 34.6428
temp: 298.150 k
press: 1.00000 atm
elementType: 17 16 8 8 8 7 7 7 6 6 6 6 6 6 6 6 6 6 6 6 1 1 1 1 1 1 1 1 1 1 1 1 1 1 1 1
symmnumber: 1
zpe: 710425.1 jmol-1
zpe.correction: 0.270587 hartree
zpe.thermalcorrener: 0.292439 hartree
zpe.thermalcorrenthalpy: 0.293383 hartree
zpe.thermalcorrgfe: 0.217158 hartree
zpe.sumelectzpe: -1713.218046 hartree
zpe.sumelectthermal: -1713.196193 hartree
zpe.sumelectthermalent: -1713.195249 hartree
zpe.sumelectthermalfe: -1713.271474 hartree
dipole: -2.9490 -2.2888 -5.0506
dipole: 6.2804
quadrupole: -143.4006 -113.5796 -142.0740
quadrupole: 1.6550 -3.4969 8.1504
quadrupole: -10.3825 19.4385 -9.0559 1.6550 -3.4969 8.1504
hfenergy: -1713.4886322 hartree
pointgroup: C01 [X(C12H16Cl1N3O3S1)]
dipole: 1.2628187 -0.3662136 2.0920297 debye
polarizability: 300.4829085|15.2548971|214.385139|-16.9355642|-32.8017263|141.6769012 unknown
InChI: InChI=1S/C12H16ClN3O3S/c1-8-10(19-7-11-14-5-6-15-11)4-3-9(13)12(8)16-20(2,17)18/h3-4,14,16H,5-7H2,1-2H3
charge 0 multiplicity 1
36 atoms
Cl -3.923156 2.545851 -0.331618
S  -3.747521 -1.681101 0.002589
O  1.645743 0.240028 -0.181447
O  -5.304777 -1.428683 -0.412999
O  -2.636257 -2.12935 -1.100758
N  4.181461 -0.535977 0.636056
N  5.036727 0.173779 -1.390196
N  -3.022336 -0.077033 1.05772
C  5.446566 -1.307656 0.549869
C  -0.66234 0.097882 0.413455
C  4.019592 0.177063 -0.553013
C  6.110836 -0.643799 -0.716151
C  -1.994462 0.620862 0.380162
C  0.369578 0.826019 -0.24341
C  2.768465 0.976832 -0.796547
C  -2.228881 1.862394 -0.294131
C  0.110615 2.053515 -0.897929
C  -0.350748 -1.193023 1.131834
C  -1.201582 2.578733 -0.911589
C  -3.742322 -2.964409 1.406509
H  5.248087 -2.387539 0.394954
H  6.058871 -1.188127 1.460318
H  6.940463 0.029552 -0.429188
H  6.510203 -1.389175 -1.424193
H  2.623037 1.091583 -1.885294
H  2.851424 1.978365 -0.326385
H  3.383642 -0.817154 1.204841
H  -3.894925 0.494532 1.086374
H  0.903736 2.607079 -1.40632
H  -0.448899 -2.051112 0.439772
H  0.68239 -1.188134 1.513885
H  -1.054603 -1.335355 1.969072
H  -1.412429 3.526556 -1.41358
H  -4.146476 -3.88512 0.962845
H  -2.699255 -3.0715 1.727861
H  -4.387266 -2.561877 2.198434
