program: Gaussian 09
title: 000210892
version: EM64L-G09RevD.01
frameworkgroup: C1[X(C8H12ClN5O)]
method: RPBEPBE
basis: SDD
operation: Freq
keyword: #p
keyword: freq=noraman
keyword: PBEPBE/SDD
title: #p freq=noraman PBEPBE/SDD
converged: NO YES NO NO
title: Mulliken charges:
elementType: Cl O N N N N N C C C C C C C C H H H H H H H H H H H H
charge: -0.061674 -0.244059 -0.142247 -0.113178 -0.139289 -0.098479 -0.583092 -0.370622 -0.368966 -0.300014 -0.298898 0.159317 0.174947 0.025537 -0.697501 0.273622 0.226094 0.226320 0.265595 0.223514 0.197294 0.196739 0.222151 0.275150 0.279973 0.340027 0.331739
chargesum: 0.00000
title: Mulliken charges with hydrogens summed into heavy atoms:
elementType: Cl O N N N N N C C C C C C C C
charge: -0.061674 -0.244059 -0.142247 -0.113178 -0.139289 -0.098479 0.088674 0.129094 0.122948 0.120795 0.119992 0.159317 0.174947 0.025537 -0.142378
polarizability: 1.80379216e+02 9.00161837e+00 1.51044799e+02 6.24941645e+00 6.94444116e-01 8.87782789e+01
1716.lowfreq: -7.1910 -3.6818 0.0006 0.0015 0.0020 6.6984 28.7040 44.5755 56.0455
frequency: 28.6930 44.5520 56.0448 95.5795 131.6516 158.1964 195.4614 234.0044 246.0585 257.2898 291.2815 337.4414 376.1305 402.5273 457.8342 502.4938 513.4985 526.0357 550.7193 557.7258 577.6124 613.3149 644.0923 711.4566 733.0888 790.2163 810.4597 832.0288 835.4757 895.9930 898.5972 908.4356 973.0636 1010.8448 1017.0905 1032.7500 1052.1121 1070.6350 1099.0805 1128.5934 1150.1749 1185.7628 1192.1153 1243.9125 1260.2580 1267.5383 1270.6426 1290.2458 1326.2568 1341.1772 1354.5019 1364.4658 1365.9758 1426.8533 1440.9611 1448.3073 1453.0622 1456.1203 1461.0355 1466.2978 1526.8824 1552.6919 1618.4863 2952.7779 2957.3936 2982.3981 2985.4708 3085.6222 3087.1563 3088.8509 3096.4229 3096.8578 3181.5180 3552.3222 3711.5475
redmass: 8.6542 5.1630 3.8359 8.6377 3.6907 7.7593 6.8623 2.5010 4.3515 3.5613 2.7912 4.2800 2.7175 2.0373 2.7677 1.2433 4.9455 3.7674 1.2815 2.8237 5.9699 2.7490 4.0822 11.2781 8.2716 4.4630 9.3109 3.9921 1.6678 2.4856 6.8670 2.0800 2.6282 2.9609 2.5049 2.4249 2.4091 3.1527 2.1391 1.5983 1.5880 2.1237 1.1992 2.5959 1.8245 1.2074 1.2882 1.8146 1.2321 1.2602 1.4402 2.3465 1.7151 1.5754 2.2252 1.0990 1.1337 1.0772 1.1236 6.1880 3.4315 3.7847 1.9434 1.0681 1.0680 1.0662 1.0667 1.0958 1.0561 1.0976 1.0954 1.0963 1.1125 1.0444 1.1057
irintensity: 1.2506 0.1777 0.0749 3.4141 0.1646 3.0333 5.7338 4.9023 6.0466 4.2740 8.6991 7.3122 1.7572 0.9274 0.2326 287.6289 20.3239 5.7588 2.5898 3.6512 12.1165 7.6211 32.3152 0.5023 29.5036 13.6410 10.8613 25.0615 0.2297 18.3668 5.3604 15.9570 21.5354 0.7784 30.3431 1.3625 47.4997 27.0896 3.3462 12.5968 4.4817 0.5936 2.0928 65.9376 31.5017 9.5029 0.6320 128.9947 0.5094 9.7016 7.5102 0.5008 2.6943 13.6647 51.2840 6.4802 26.7053 9.9652 35.2185 298.4934 516.6072 801.7047 340.8637 42.2218 57.3312 6.1926 110.4544 38.6491 13.0787 42.7433 5.1508 6.9837 2.6922 115.1522 48.9154
temp: 298.150 k
press: 1.00000 atm
elementType: 17 8 7 7 7 7 7 6 6 6 6 6 6 6 6 1 1 1 1 1 1 1 1 1 1 1 1
symmnumber: 1
zpe: 555307.9 jmol-1
zpe.correction: 0.211506 hartree
zpe.thermalcorrener: 0.225296 hartree
zpe.thermalcorrenthalpy: 0.226240 hartree
zpe.thermalcorrgfe: 0.169283 hartree
zpe.sumelectzpe: -1119.965850 hartree
zpe.sumelectthermal: -1119.952060 hartree
zpe.sumelectthermalent: -1119.951116 hartree
zpe.sumelectthermalfe: -1120.008073 hartree
dipole: -1.6861 3.0081 1.1741
dipole: 3.6428
quadrupole: -108.9484 -79.8428 -93.3784
quadrupole: 3.6932 5.4402 -3.7875
quadrupole: -14.8919 14.2137 0.6782 3.6932 5.4402 -3.7875
hfenergy: -1120.1773556 hartree
pointgroup: C01 [X(C8H12Cl1N5O1)]
dipole: -0.47171 -1.2134727 -0.5991928 debye
polarizability: 182.6290368|-4.0588229|148.5585107|-3.9311996|5.6316438|89.0147464 unknown
InChI: InChI=1S/C8H12ClN5O/c9-5-6-11-7(10)13-8(12-6)14-1-3-15-4-2-14/h1-5,10H2
charge 0 multiplicity 1
27 atoms
Cl 3.70793 2.359987 1.056207
O  -4.155085 0.426276 -0.164326
N  -1.376125 0.028545 0.410572
N  0.761642 0.885327 -0.102349
N  0.383273 -1.516749 0.131132
N  2.615538 -0.660845 -0.393595
N  2.20673 -2.955279 -0.17601
C  -1.94598 1.391184 0.454141
C  -2.341763 -1.056029 0.677213
C  -3.162061 1.466311 -0.489672
C  -3.547447 -0.911436 -0.273377
C  -0.051113 -0.21081 0.142025
C  2.067178 0.587874 -0.347534
C  1.711685 -1.679224 -0.143664
C  2.996111 1.744253 -0.593867
H  -1.159573 2.105952 0.165721
H  -2.270028 1.612366 1.491037
H  -2.689575 -0.978645 1.727145
H  -1.829166 -2.020903 0.53996
H  -3.692523 2.425082 -0.371417
H  -2.829742 1.352019 -1.544112
H  -3.22486 -1.094641 -1.321259
H  -4.347787 -1.619927 -0.004337
H  2.466317 2.60674 -1.017176
H  3.866771 1.439754 -1.18763
H  3.197965 -3.091116 -0.358998
H  1.588092 -3.739563 0.013668
