program: Gaussian 09
title: 000210891
version: EM64L-G09RevD.01
frameworkgroup: C1[X(C14H17ClN6)]
method: RPBEPBE
basis: SDD
operation: Freq
keyword: #p
keyword: freq=noraman
keyword: PBEPBE/SDD
title: #p freq=noraman PBEPBE/SDD
converged: YES YES NO NO
title: Mulliken charges:
elementType: Cl N N N N N N C C C C C C C C C C C C C C H H H H H H H H H H H H H H H H H
charge: -0.062923 -0.178198 -0.125864 -0.112692 -0.122163 -0.099395 -0.582241 -0.418407 -0.384400 -0.360298 -0.415369 0.439753 0.144685 -0.373257 -0.365055 -0.228284 -0.228914 -0.269297 0.174179 0.020253 -0.699124 0.231696 0.216580 0.230435 0.222360 0.247341 0.237363 0.283188 0.224324 0.224478 0.237009 0.218197 0.219072 0.225579 0.280399 0.276290 0.339972 0.332727
chargesum: 0.00000
title: Mulliken charges with hydrogens summed into heavy atoms:
elementType: Cl N N N N N N C C C C C C C C C C C C C C
charge: -0.062923 -0.178198 -0.125864 -0.112692 -0.122163 -0.099395 0.090459 0.029869 0.068394 0.124405 0.092144 0.439753 0.144685 -0.148779 -0.128046 -0.010087 -0.009842 -0.043718 0.174179 0.020253 -0.142435
polarizability: 3.16831820e+02 -9.75389566e+00 2.03366284e+02 1.86586339e+00 4.77903853e+00 1.22678681e+02
1716.lowfreq: -11.6635 -7.5609 -3.9683 -0.0016 -0.0010 -0.0006 9.4589 25.8555 35.6879
frequency: 8.6191 25.7996 35.6570 47.4534 81.4431 88.6312 109.5619 130.4172 157.2493 184.6655 190.7293 202.4434 231.9072 255.6574 279.9864 289.3616 319.4451 369.6358 406.5696 415.8404 432.8492 490.6114 501.4289 511.1623 524.4703 551.1378 556.5010 568.8899 584.7853 613.4523 615.0161 649.5005 691.9565 710.2108 713.9188 734.0949 751.9570 807.4755 811.3492 829.2921 857.1955 869.0101 894.0002 899.8962 928.1614 951.7244 954.2703 973.9382 976.1545 984.7052 1015.4695 1030.1218 1033.1818 1054.9485 1076.8262 1082.1730 1091.0970 1126.6425 1150.7168 1172.0778 1182.8497 1199.9516 1201.2554 1216.9201 1246.8762 1252.0741 1266.3163 1270.4690 1280.1896 1333.7833 1339.3016 1353.3496 1358.7360 1362.0055 1366.0369 1379.0658 1390.2036 1424.7136 1437.3494 1449.2493 1463.9190 1476.4860 1480.2521 1489.8729 1494.2392 1503.3489 1524.8503 1545.6727 1577.1163 1617.4680 1622.2673 2924.4580 2934.7221 2978.0887 2984.4412 3011.2031 3043.6688 3060.2919 3087.0165 3093.4452 3121.3052 3127.5919 3150.6819 3155.4482 3168.4420 3181.8190 3553.0596 3712.8147
redmass: 5.7207 9.0852 4.6569 4.2904 4.7192 5.6932 3.5513 4.8333 3.9117 4.1827 5.4514 6.4321 3.9980 6.7588 2.0774 2.6326 2.9606 2.8199 4.1268 3.1661 3.8252 3.2597 1.2419 2.7958 3.8354 1.4236 2.4164 6.6868 5.6584 4.9487 3.0699 3.7091 1.8166 4.9555 7.7237 8.1646 1.8785 2.1768 2.5108 3.8316 1.5012 1.5191 4.7619 2.7756 3.2413 2.2027 1.3948 1.3456 4.7179 2.2761 2.8396 2.6242 2.1781 1.9582 2.1102 2.0197 1.6385 1.6414 1.6130 1.0574 2.8361 1.4314 1.2722 1.2127 2.0671 2.2667 1.2181 1.6666 1.7365 1.4107 1.3419 1.8030 1.6871 1.5554 2.9993 2.0741 3.3875 1.7819 2.1620 2.5669 4.7629 1.2106 1.1100 1.1830 1.1174 2.0239 3.3577 4.0171 5.9958 1.9781 5.7556 1.0702 1.0675 1.0689 1.0655 1.0956 1.0908 1.0977 1.0560 1.0937 1.0844 1.0883 1.0912 1.0941 1.1005 1.1126 1.0443 1.1058
irintensity: 0.3922 0.9124 0.4813 0.4281 1.8418 2.1632 1.7250 7.4419 1.6518 5.6728 0.1842 2.9338 0.9383 2.7248 2.1525 5.7944 4.4071 1.0811 8.9764 0.2733 2.1677 3.1373 283.4556 15.1134 9.9211 0.8001 2.6238 2.7229 8.0794 1.9179 9.8211 23.8178 42.3031 0.1259 0.3786 28.5835 84.3848 4.7151 7.2597 5.1831 1.2538 6.0145 12.5612 11.3978 35.9462 5.3410 0.2761 0.8298 6.6268 40.2268 12.6388 15.4569 3.4730 5.6254 1.6634 5.4134 4.6366 8.5044 6.4470 0.3631 39.6153 4.0826 1.0319 168.1334 6.9167 17.8539 15.6443 3.6236 45.1025 1.3733 1.7339 21.0376 34.1117 30.7197 8.6850 140.4522 12.0200 21.9006 81.2571 0.1805 284.8092 278.6663 25.4810 62.1736 3.3033 159.5622 498.2179 921.7664 11.2990 359.9335 162.2055 83.5706 34.2408 43.8943 21.9431 46.1399 22.6541 17.7279 13.5386 5.9060 11.8555 10.0457 39.1035 38.0636 8.1521 2.7788 120.8079 49.8240
temp: 298.150 k
press: 1.00000 atm
elementType: 17 7 7 7 7 7 7 6 6 6 6 6 6 6 6 6 6 6 6 6 6 1 1 1 1 1 1 1 1 1 1 1 1 1 1 1 1 1
symmnumber: 1
zpe: 795505.5 jmol-1
zpe.correction: 0.302992 hartree
zpe.thermalcorrener: 0.321911 hartree
zpe.thermalcorrenthalpy: 0.322855 hartree
zpe.thermalcorrgfe: 0.252467 hartree
zpe.sumelectzpe: -1330.740403 hartree
zpe.sumelectthermal: -1330.721485 hartree
zpe.sumelectthermalent: -1330.720540 hartree
zpe.sumelectthermalfe: -1330.790928 hartree
dipole: 0.4970 3.6001 1.0019
dipole: 3.7698
quadrupole: -141.1500 -118.0484 -130.4637
quadrupole: -13.4630 -2.0844 -3.7752
quadrupole: -11.2626 11.8390 -0.5764 -13.4630 -2.0844 -3.7752
hfenergy: -1331.0433952 hartree
pointgroup: C01 [X(C14H17Cl1N6)]
dipole: -0.0812686 -1.3047956 0.7005021 debye
polarizability: 317.3518234|-3.3626971|196.6422796|-7.1151733|-21.4271559|128.8826814 unknown
InChI: InChI=1S/C14H17ClN6/c15-10-12-17-13(16)19-14(18-12)21-8-6-20(7-9-21)11-4-2-1-3-5-11/h1-5H,6-10,16H2
charge 0 multiplicity 1
38 atoms
Cl 5.000584 2.833603 -1.482825
N  -2.21961 -0.023371 0.213487
N  0.667187 -0.236925 0.369318
N  2.756143 0.862643 0.31212
N  2.560062 -1.536155 -0.127804
N  4.749504 -0.440563 -0.178845
N  4.522411 -2.736678 -0.573519
C  -1.575414 -1.203152 0.81638
C  -1.344838 1.112264 -0.144469
C  -0.174809 -1.446201 0.224235
C  -0.019181 1.044687 0.633351
C  -3.609957 0.050987 0.027951
C  2.022557 -0.306544 0.180043
C  -4.49725 -0.895711 0.630434
C  -4.185611 1.086259 -0.77467
C  -5.88908 -0.811169 0.424071
C  -5.580376 1.160847 -0.963101
C  -6.449223 0.21478 -0.371877
C  4.094682 0.722444 0.106454
C  3.918804 -1.542607 -0.284034
C  4.934468 1.965635 0.204694
H  -2.180848 -2.100266 0.596143
H  -1.505964 -1.11792 1.92367
H  -1.848196 2.063076 0.118577
H  -1.133686 1.139335 -1.235838
H  0.314868 -2.292669 0.736341
H  -0.256383 -1.719303 -0.84658
H  0.65547 1.860744 0.331533
H  -0.215642 1.155928 1.718769
H  -4.109112 -1.682122 1.285456
H  -3.544408 1.818191 -1.275327
H  -6.542352 -1.550011 0.903336
H  -5.989224 1.963001 -1.588913
H  -7.531451 0.276493 -0.524682
H  5.977024 1.725862 0.447098
H  4.490162 2.700662 0.887458
H  5.529407 -2.754407 -0.714669
H  3.954581 -3.574166 -0.672865
