program: Gaussian 09
title: 000210890
version: EM64L-G09RevD.01
frameworkgroup: C1[X(C12H18N6)]
method: RPBEPBE
basis: SDD
operation: Freq
keyword: #pfreq=noraman
keyword: PBEPBE/SDD
title: #p freq=noraman PBEPBE/SDD
converged: YES YES NO NO
title: Mulliken charges:
elementType: N N N N N N C C C C C C C C C C C C H H H H H H H H H H H H H H H H H H
charge: -0.172912 -0.178294 -0.153920 -0.358900 -0.629666 -0.637795 -0.423274 -0.392803 -0.366011 -0.396617 0.439254 0.019101 -0.370778 -0.373006 -0.229717 -0.228974 -0.271836 0.226193 0.205135 0.229853 0.224229 0.224459 0.239241 0.242429 0.212923 0.251673 0.231974 0.230168 0.216284 0.216446 0.223315 0.236361 0.337585 0.305415 0.306591 0.365875
chargesum: 0.00000
title: Mulliken charges with hydrogens summed into heavy atoms:
elementType: N N N N N N C C C C C C C C C C C C
charge: -0.172912 -0.178294 -0.153920 -0.122540 0.013335 0.034671 0.011713 0.055885 0.115659 0.067979 0.439254 0.019101 -0.138805 -0.142838 -0.013433 -0.012528 -0.048522 0.226193
polarizability: 2.50539326e+02 -2.60370625e+00 1.49127182e+02 -5.32263324e+00 6.92434107e+00 1.35296832e+02
1716.lowfreq: -19.0437 -10.0620 -5.8470 -0.0005 -0.0004 0.0003 18.5338 42.4818 60.6861
frequency: 17.8710 42.3621 60.6167 67.2656 80.4675 110.8214 139.4240 156.6249 186.5260 224.3530 240.7438 264.5259 286.6100 304.5190 340.6393 378.1373 410.6502 415.1784 430.5424 439.2796 479.3559 493.9080 511.3438 519.4304 543.6091 596.2421 611.7706 613.7888 631.3064 680.4206 690.8011 697.3119 713.6329 738.9516 751.3111 802.0752 808.6190 854.9684 866.5623 878.9074 924.2379 952.1588 959.6169 972.1301 974.0197 979.2823 1009.0912 1029.8046 1045.9948 1050.1925 1068.8350 1084.4636 1087.6093 1116.0295 1159.0592 1169.7298 1171.3234 1194.0787 1197.2858 1220.3822 1238.8918 1270.1834 1273.9563 1330.7830 1337.4749 1352.1795 1355.3637 1358.0851 1366.3452 1378.0135 1387.9268 1446.4810 1448.5002 1474.4294 1475.4747 1488.8402 1489.1382 1502.9896 1567.2271 1574.3728 1592.1099 1596.1242 1621.7882 1654.4282 2915.2507 2933.5429 2974.1546 2981.2397 3021.3405 3023.5459 3062.0881 3072.1802 3119.2770 3125.5148 3148.7476 3153.3902 3166.6729 3383.2347 3477.5244 3552.3881 3647.2517 3704.2073
redmass: 4.8551 4.2293 4.2375 5.0947 4.0992 3.3287 4.3961 3.7708 3.9037 3.8087 4.6836 3.5009 1.9718 1.2190 2.4357 3.0649 1.8273 2.4333 3.7065 2.1824 2.7828 2.7732 2.7580 1.2280 3.9302 2.1747 3.1588 3.2066 2.1860 3.2584 1.8074 3.9956 4.4143 5.0415 1.8918 1.2317 1.2648 1.5364 1.5639 3.6672 3.7159 1.3723 2.0034 1.4807 2.9940 3.0666 1.8819 2.1683 1.7787 1.7975 1.9282 2.1112 1.6328 1.8135 2.0144 1.2682 1.8937 1.8064 1.1341 1.2248 1.7127 1.4205 1.4647 1.4148 1.3415 1.6410 2.4635 1.5031 1.4400 2.3878 3.8198 3.7912 2.6005 1.1256 1.0930 1.1540 1.1073 2.2118 3.2678 6.0092 1.9108 1.3504 5.9841 2.5053 1.0698 1.0680 1.0671 1.0672 1.0947 1.0918 1.0959 1.0954 1.0843 1.0883 1.0913 1.0945 1.1006 1.0750 1.0484 1.0450 1.1012 1.1043
irintensity: 1.3796 0.9691 1.4280 1.5696 1.0592 0.5764 3.1191 3.8728 11.9917 7.9786 1.3842 6.8693 12.7548 87.5288 7.4887 9.4078 202.0225 48.1288 5.4516 53.7851 20.4369 2.3160 12.4834 92.5621 8.3690 5.9448 35.1603 29.7048 21.3661 69.4941 46.8917 13.9684 0.9995 10.8092 80.8236 80.4782 4.8491 1.4969 5.6167 47.9924 3.5556 0.1108 4.7044 3.4742 2.5818 81.3749 78.5086 12.8441 6.3290 8.1713 14.8924 4.1452 4.7072 108.4431 19.6939 14.9267 29.3991 12.2901 3.9182 89.1111 10.3206 55.8368 31.5583 1.2986 1.5618 66.9967 202.8844 29.9183 54.3464 107.3423 7.6958 128.8282 0.0530 67.2220 23.9603 49.7262 22.6654 120.0597 239.9566 12.9146 216.0743 152.3707 256.7576 635.1363 81.3668 43.8066 45.7090 16.4836 33.5831 34.2238 22.9561 9.9505 11.0997 11.0669 37.7615 40.2764 9.3363 13.0069 54.4383 56.3977 52.8485 32.8144
temp: 298.150 k
press: 1.00000 atm
elementType: 7 7 7 7 7 7 6 6 6 6 6 6 6 6 6 6 6 6 1 1 1 1 1 1 1 1 1 1 1 1 1 1 1 1 1 1
symmnumber: 1
zpe: 786481.6 jmol-1
zpe.correction: 0.299555 hartree
zpe.thermalcorrener: 0.316764 hartree
zpe.thermalcorrenthalpy: 0.317708 hartree
zpe.thermalcorrgfe: 0.253594 hartree
zpe.sumelectzpe: -795.221230 hartree
zpe.sumelectthermal: -795.204021 hartree
zpe.sumelectthermalent: -795.203077 hartree
zpe.sumelectthermalfe: -795.267191 hartree
dipole: 3.5515 -3.3821 3.8220
dipole: 6.2177
quadrupole: -96.3814 -105.5384 -103.5146
quadrupole: -16.4626 13.1198 6.4401
quadrupole: 5.4300 -3.7269 -1.7031 -16.4626 13.1198 6.4401
hfenergy: -795.520785 hartree
pointgroup: C01 [X(C12H18N6)]
dipole: 1.3439625 1.5768557 -1.3004984 debye
polarizability: 250.4932226|4.4557623|146.8972101|4.1825037|8.7627426|137.5729073 unknown
InChI: InChI=1S/C12H18N6/c13-11(14)16-12(15)18-8-6-17(7-9-18)10-4-2-1-3-5-10/h1-5,15H,6-9,13-14H2
charge 0 multiplicity 1
36 atoms
N  -1.240568 -0.16931 -0.017088
N  1.672009 -0.55444 -0.087386
N  3.823191 0.228609 0.70681
N  3.142774 -2.092909 0.921728
N  5.280419 1.848752 -0.135049
N  3.826515 0.777697 -1.648849
C  -0.609416 -1.229735 -0.827749
C  -0.33554 0.673712 0.786288
C  0.71623 -1.687664 -0.197443
C  1.04016 0.781711 0.096807
C  -2.629565 0.019268 -0.002905
C  2.916979 -0.851141 0.53749
C  -3.471048 -0.607869 -0.976442
C  -3.25578 0.846192 0.983745
C  -4.866812 -0.41416 -0.955115
C  -4.65232 1.036016 0.984181
C  -5.476015 0.41001 0.019789
C  4.26972 0.91466 -0.334631
H  -0.441319 -0.899012 -1.877617
H  -1.280501 -2.108256 -0.865096
H  -0.21268 0.286597 1.821562
H  -0.75765 1.693942 0.860047
H  0.535226 -2.130993 0.802688
H  1.178019 -2.483818 -0.80601
H  0.901404 1.282648 -0.882199
H  1.710293 1.410477 0.706256
H  -3.033769 -1.225377 -1.76703
H  -2.657532 1.315605 1.770853
H  -5.482841 -0.906064 -1.717485
H  -5.101375 1.671028 1.757335
H  -6.560726 0.558158 0.028903
H  4.107613 -2.187561 1.29014
H  5.653229 1.914924 0.808966
H  5.435867 2.61259 -0.787553
H  4.408146 1.054009 -2.436777
H  3.034664 0.149101 -1.802466
