program: Gaussian 09
title: 000210888
version: EM64L-G09RevD.01
frameworkgroup: C1[X(C17H17ClN2O3S)]
method: RPBEPBE
basis: SDD
operation: Freq
keyword: #p
keyword: freq=noraman
keyword: PBEPBE/SDD
title: #p freq=noraman PBEPBE/SDD
converged: YES YES NO NO
title: Mulliken charges:
elementType: Cl S O O O N N C C C C C C C C C C C C C C C C C H H H H H H H H H H H H H H H H H
charge: -0.031930 1.005911 -0.318612 -0.546528 -0.477025 -0.109201 -0.682147 -0.425071 -0.408384 -0.556930 -0.556308 0.361370 0.368230 0.393712 -0.436303 -0.436924 -0.239128 -0.237230 -0.054825 -0.242711 -0.159840 -0.186201 -0.206626 -0.097306 0.203038 0.242164 0.226005 0.269825 0.234011 0.220175 0.222255 0.232544 0.232588 0.234168 0.350602 0.230879 0.230844 0.298147 0.314346 0.268913 0.269502
chargesum: 0.00000
title: Mulliken charges with hydrogens summed into heavy atoms:
elementType: Cl S O O O N N C C C C C C C C C C C C C C C C C
charge: -0.031930 1.005911 -0.318612 -0.546528 -0.477025 -0.109201 -0.331545 0.020131 0.087446 -0.102744 -0.101509 0.361370 0.368230 0.393712 -0.203715 -0.202756 -0.008249 -0.006386 -0.054825 0.055437 0.154505 0.082712 0.062877 -0.097306
polarizability: 2.97318454e+02 -1.19497148e+01 2.23203799e+02 -5.21918497e+00 2.10532227e+01 2.07247609e+02
1716.lowfreq: -5.5600 -0.0017 -0.0015 0.0009 1.0447 5.4419 11.3842 21.2031 30.7004
frequency: 10.5853 20.4154 30.6902 50.1614 55.0856 74.2860 90.4167 103.0506 126.8338 134.0971 147.9536 176.5905 209.4924 214.0374 242.6528 247.7055 278.6938 286.8880 308.3801 322.7248 365.8477 372.5425 383.7916 401.1405 410.4056 414.5118 423.4971 443.9795 452.9547 489.8298 492.7048 509.5417 545.7983 571.0106 580.2837 596.6890 610.7105 682.8928 695.3156 697.8333 698.9622 709.4523 747.5727 763.5290 793.7703 795.3528 811.6456 817.7673 835.6917 877.7809 888.5026 926.4073 945.0470 946.4015 953.9653 957.8756 960.4230 972.3937 980.1696 990.5616 1023.4239 1030.9317 1046.1365 1051.1600 1065.3462 1067.9473 1103.5112 1108.4672 1162.2580 1169.9396 1176.2736 1178.8602 1185.9094 1197.5731 1214.2210 1229.1840 1269.0890 1285.4926 1298.0222 1309.5654 1328.3326 1333.2114 1345.3891 1367.0371 1379.8748 1380.7723 1384.8697 1411.6964 1436.6935 1449.9401 1451.6171 1455.2244 1459.8032 1485.2890 1492.2578 1565.5731 1578.4514 1588.2348 1595.1295 1611.9807 2972.2866 2976.0229 2998.9318 3006.5305 3039.6936 3043.4907 3055.6022 3095.4519 3115.5946 3120.2200 3140.2092 3159.4380 3162.4881 3173.2081 3181.7323 3193.3693 3515.5582
redmass: 8.1955 4.4012 7.1022 4.0108 5.8570 9.5591 5.6434 5.6989 8.6185 8.0128 4.8382 3.9311 9.9529 10.7691 10.0394 2.7630 7.8683 7.1927 4.0775 4.1481 4.0856 4.7008 2.9387 2.1538 2.9087 2.9209 2.2816 2.7266 3.5609 3.6161 5.8574 3.8363 3.4550 3.9497 3.0536 2.8842 7.0868 5.1410 7.0120 6.1601 4.3205 5.4227 3.7740 1.2274 3.9430 3.4691 3.2748 1.8604 1.3892 1.3396 2.2298 2.6273 1.5192 1.7596 1.5515 3.9736 4.3717 1.3983 6.9560 1.3343 2.5429 3.0817 2.7465 2.4121 2.6196 2.1868 2.1487 1.3290 1.5975 1.6501 1.0826 1.1334 1.1951 2.5504 1.3700 1.7950 1.6485 1.2330 1.4681 1.4683 1.4139 1.4210 1.3069 1.5407 4.0612 3.6261 5.3380 2.6279 2.0240 2.0118 1.1601 1.1528 1.1473 1.5883 1.4031 6.0755 7.5407 6.5526 8.2022 6.3421 1.0629 1.0636 1.0621 1.0652 1.0977 1.0974 1.1022 1.0992 1.0867 1.0893 1.0926 1.0899 1.1007 1.0903 1.0965 1.0970 1.0782
irintensity: 0.0272 0.4779 0.0994 0.1315 1.6209 2.1473 1.4842 2.9138 5.5409 4.6813 0.2068 1.6725 5.4336 2.3868 2.4456 3.6950 1.4649 12.8562 3.4963 4.9675 31.8790 10.9390 40.2180 82.3829 5.6875 27.9995 8.4747 10.6276 13.4632 4.6888 20.5687 125.2806 21.0475 1.2964 1.9300 9.6193 0.6500 77.0758 2.9234 22.1273 10.0358 127.6087 0.1729 63.2768 8.2063 16.7849 134.0343 28.0041 42.0492 0.4407 4.0301 10.4868 15.1892 29.1112 27.2497 47.1280 25.8565 1.8945 30.4764 0.0042 1.4850 7.2634 35.7866 31.1944 52.9944 16.5205 5.0900 5.7636 74.9977 62.1279 7.4894 6.1697 3.2869 8.4915 17.5766 0.1242 0.0349 3.1138 46.9945 140.1751 6.2568 53.3545 16.5448 14.4062 21.4104 4.9531 2.1475 371.6825 1.7511 62.1771 46.0884 5.7693 11.2352 10.5928 29.4468 58.8711 248.8953 0.5173 6.2858 0.5884 17.6739 14.8841 25.5732 36.5922 38.9985 28.7326 52.1981 2.6438 13.5844 2.4359 25.7761 3.9515 32.5574 1.9626 1.2221 9.4903 29.3104
temp: 298.150 k
press: 1.00000 atm
elementType: 17 16 8 8 8 7 7 6 6 6 6 6 6 6 6 6 6 6 6 6 6 6 6 6 1 1 1 1 1 1 1 1 1 1 1 1 1 1 1 1 1
symmnumber: 1
zpe: 812681.9 jmol-1
zpe.correction: 0.309534 hartree
zpe.thermalcorrener: 0.331790 hartree
zpe.thermalcorrenthalpy: 0.332734 hartree
zpe.thermalcorrgfe: 0.255124 hartree
zpe.sumelectzpe: -1849.405341 hartree
zpe.sumelectthermal: -1849.383085 hartree
zpe.sumelectthermalent: -1849.382141 hartree
zpe.sumelectthermalfe: -1849.459751 hartree
dipole: 4.7892 2.9237 -1.7272
dipole: 5.8709
quadrupole: -145.5744 -170.4328 -150.9269
quadrupole: -11.6423 1.3551 6.8402
quadrupole: 10.0703 -14.7881 4.7178 -11.6423 1.3551 6.8402
hfenergy: -1849.7148751 hartree
pointgroup: C01 [X(C17H17Cl1N2O3S1)]
dipole: -2.0321273 -1.0586659 -0.2913388 debye
polarizability: 292.1664612|-19.5373499|209.3634304|10.8653054|-22.5608158|226.2399704 unknown
InChI: InChI=1S/C17H17ClN2O3S/c18-15-5-7-16(8-6-15)24(22,23)19-17(21)20-11-9-13-3-1-2-4-14(13)10-12-20/h1-8,19H,9-12H2
charge 0 multiplicity 1
41 atoms
Cl 5.306427 -3.929183 1.370274
S  2.798453 1.568633 -0.871503
O  0.859538 1.068843 1.431384
O  3.07193 1.595818 -2.476476
O  3.24692 2.800219 0.070828
N  -1.129567 1.504178 0.266324
N  0.963552 1.35456 -0.871066
C  -1.881917 1.682075 -0.989096
C  -1.923836 1.189972 1.475475
C  -2.44066 0.350663 -1.570872
C  -2.542065 -0.23607 1.44007
C  -3.703558 -0.152363 -0.877344
C  -3.751957 -0.414708 0.527739
C  0.247273 1.307596 0.341806
C  -4.86879 -0.364206 -1.656531
C  -4.968069 -0.876765 1.092061
C  -6.07291 -0.827118 -1.081155
C  -6.122898 -1.084344 0.30564
C  3.475678 -0.049425 -0.184617
C  3.892097 -1.003303 -1.127342
C  3.592887 -0.205247 1.205464
C  4.457483 -2.204108 -0.643218
C  4.162509 -1.40738 1.68098
C  4.578875 -2.382682 0.750414
H  -1.245066 2.185676 -1.738259
H  -2.722145 2.373194 -0.78824
H  -2.719791 1.95129 1.578419
H  -1.240372 1.27122 2.3356
H  -1.632814 -0.408411 -1.524067
H  -2.664885 0.508477 -2.642564
H  -2.837358 -0.495774 2.473824
H  -1.732341 -0.941215 1.161839
H  -4.829916 -0.163815 -2.734528
H  -5.006896 -1.079951 2.169392
H  0.583441 1.598545 -1.791209
H  -6.957899 -0.982739 -1.707762
H  -7.04776 -1.44246 0.771019
H  3.796474 -0.806219 -2.199719
H  3.233973 0.56925 1.887287
H  4.799412 -2.977704 -1.335703
H  4.272646 -1.580622 2.754631
