program: Gaussian 09
title: 000210883
version: EM64L-G09RevD.01
frameworkgroup: C1[X(C12H17ClS)]
method: RPBEPBE
basis: SDD
operation: Freq
keyword: #p
keyword: freq=noraman
keyword: PBEPBE/SDD
title: #p freq=noraman PBEPBE/SDD
converged: YES YES NO NO
title: Mulliken charges:
elementType: Cl S C C C C C C C C C C C C H H H H H H H H H H H H H H H H H
charge: -0.093946 0.145814 -0.351412 -0.651300 -0.555421 -0.642799 -0.321600 0.618823 -0.687135 -0.424929 -0.364785 -0.220309 -0.230646 -0.237782 0.209730 0.204481 0.293820 0.274275 0.258400 0.266809 0.286641 0.196297 0.214498 0.216960 0.205255 0.210404 0.237246 0.249555 0.230933 0.229975 0.232149
chargesum: 0.00000
title: Mulliken charges with hydrogens summed into heavy atoms:
elementType: Cl S C C C C C C C C C C C C
charge: -0.093946 0.145814 0.062799 -0.118625 -0.261601 -0.089349 0.089196 0.618823 -0.054517 -0.187682 -0.115231 0.010623 -0.000671 -0.005634
polarizability: 1.70576071e+02 -1.93491808e+01 1.59144492e+02 5.49693033e+00 5.40362400e+00 1.30336251e+02
1716.lowfreq: -12.1287 -8.8307 -4.8243 -0.0021 0.0004 0.0006 7.4068 21.6610 37.0642
frequency: 4.7400 21.2710 36.9976 62.7172 67.0289 104.7754 116.0214 149.8041 162.4076 208.0083 221.9627 230.5481 250.6171 270.8910 320.4953 389.3962 401.1400 470.0883 508.0800 549.7709 609.2659 613.2279 631.3280 684.7597 701.5604 741.9899 759.4357 778.9377 805.5534 852.1572 867.5592 913.0886 921.2801 931.8034 978.0303 990.0173 997.9917 1016.1456 1022.3657 1049.2530 1063.7351 1065.5188 1079.9737 1109.3439 1145.5223 1172.6861 1177.0891 1189.6070 1191.3508 1212.8109 1224.9221 1250.0802 1277.1512 1293.7917 1305.6843 1309.8972 1351.3424 1358.0990 1387.5877 1387.9884 1439.7938 1442.8233 1451.9844 1457.8854 1474.4987 1477.5220 1483.1481 1486.2943 1592.2640 1610.5534 2962.6363 2971.0584 2975.9479 3006.2296 3015.5526 3036.6238 3043.4479 3068.7349 3071.9857 3088.9921 3089.4649 3122.2804 3125.3038 3129.7015 3140.9488 3151.3802 3166.7417
redmass: 3.8705 4.3775 5.0912 2.3946 2.5709 4.0339 3.7073 7.6490 5.3383 2.3718 2.9753 1.2937 2.4043 3.7797 5.4275 3.9752 2.8035 2.9429 3.8963 3.4387 5.6692 3.7358 6.2526 5.2693 1.6679 1.1659 3.3904 1.9413 1.7079 1.2523 1.3764 1.5825 1.3735 1.5875 1.4217 5.3814 1.3378 2.7709 2.5367 2.7664 1.2981 1.9162 1.5836 2.0282 1.1804 1.0774 1.1109 1.1117 1.4776 1.9015 1.3288 1.2502 1.1984 1.1807 1.2465 1.4932 1.5012 1.5740 1.2176 5.2436 1.1315 1.9687 1.0968 1.0758 1.0563 1.0429 2.3242 1.0812 6.0091 6.0729 1.0593 1.0364 1.0634 1.0801 1.0739 1.1010 1.0587 1.1012 1.0990 1.0905 1.1059 1.1059 1.0848 1.0879 1.0921 1.0966 1.1016
irintensity: 0.0255 0.1862 0.3338 0.3815 0.0088 2.7725 0.5273 4.8252 2.4702 0.8460 0.9142 0.2497 0.4565 4.1018 5.8883 10.3047 0.6304 0.6039 15.0718 12.6888 23.5303 6.4882 99.0238 3.3426 75.0383 8.7468 2.4754 22.9440 0.8104 0.3996 5.9354 9.0909 7.1462 4.0034 0.2675 0.3266 0.0402 3.8335 3.1109 3.2589 3.5879 1.6067 6.3866 2.3324 12.0695 0.8612 1.4390 0.6201 0.9072 13.4347 1.2253 1.5831 11.8386 10.4708 5.2994 6.9744 5.1574 1.4727 11.7374 0.8550 6.7903 19.0818 5.8096 7.4001 4.8585 12.1239 4.3730 15.0394 0.4469 0.2606 14.4643 52.8960 41.9776 10.8982 17.5581 11.7712 10.0464 71.0723 42.1788 5.4351 15.7558 7.0780 2.2326 0.2293 13.8317 30.7051 17.3194
temp: 298.150 k
press: 1.00000 atm
elementType: 17 16 6 6 6 6 6 6 6 6 6 6 6 6 1 1 1 1 1 1 1 1 1 1 1 1 1 1 1 1 1
symmnumber: 1
zpe: 676192.1 jmol-1
zpe.correction: 0.257548 hartree
zpe.thermalcorrener: 0.273486 hartree
zpe.thermalcorrenthalpy: 0.274430 hartree
zpe.thermalcorrgfe: 0.209668 hartree
zpe.sumelectzpe: -1324.526662 hartree
zpe.sumelectthermal: -1324.510724 hartree
zpe.sumelectthermalent: -1324.509780 hartree
zpe.sumelectthermalfe: -1324.574542 hartree
dipole: -2.3396 1.9786 1.1723
dipole: 3.2807
quadrupole: -111.3049 -97.3991 -92.8845
quadrupole: -1.1975 1.3092 -0.4480
quadrupole: -10.7754 3.1304 7.6450 -1.1975 1.3092 -0.4480
hfenergy: -1324.7842102 hartree
pointgroup: C01 [X(C12H17Cl1S1)]
dipole: 0.4782308 0.7183532 0.9598048 debye
polarizability: 151.9271244|-3.6789805|134.8519303|17.5300925|13.1255822|173.2777604 unknown
InChI: InChI=1S/C12H17ClS/c1-2-3-9-14-10-12(13)11-7-5-4-6-8-11/h4-8,12H,2-3,9-10H2,1H3
charge 0 multiplicity 1
31 atoms
Cl -2.372637 -0.916767 -3.013205
S  2.008393 -0.58127 -1.844062
C  3.387478 0.916232 0.119099
C  2.187998 1.02876 -0.838968
C  -0.799045 -0.920698 -1.853191
C  0.328894 -0.300918 -2.683979
C  3.190287 -0.103555 1.264687
C  -1.1481 -0.231548 -0.555928
C  4.400339 -0.154391 2.221524
C  -1.06886 -0.949825 0.662999
C  -1.54241 1.132041 -0.527219
C  -1.357776 -0.314457 1.89252
C  -1.839309 1.765282 0.697624
C  -1.743225 1.044916 1.913225
H  4.303324 0.665576 -0.454015
H  3.561478 1.921555 0.556638
H  -0.619534 -1.996345 -1.704806
H  1.249446 1.188172 -0.282583
H  2.330525 1.84834 -1.564903
H  0.184978 0.78048 -2.841224
H  0.400264 -0.795664 -3.664951
H  2.27388 0.162891 1.830005
H  3.007929 -1.106808 0.833942
H  4.238459 -0.88371 3.036284
H  4.586365 0.833402 2.684853
H  5.320309 -0.450659 1.682747
H  -0.770352 -2.004564 0.649721
H  -1.64527 1.685549 -1.467469
H  -1.287049 -0.879754 2.828298
H  -2.151947 2.815396 0.707445
H  -1.974832 1.537441 2.864194
